{"text_format":"1","workbook":"xlsx","n_sheets":10,"sheets":["Tables","Configure Tool","PANELS","USLIM Configure Tool","USLIM Tables","Samsung IER IFR IEA Conf. Tool ","IER Tables ","Sony Configure Tool","Sony Tables","LG LSCB Configure Tool "],"not_rendered":{"charts":0,"images":11,"macros":1,"external_links":9,"defined_names":6011,"comments":0,"pivot_tables":0},"unopened":[],"bounds":{"document_bytes":16777216,"sheet_cells":100000,"rows_first":2000,"rows_last":500,"rows_between":2000,"halvings":0,"cell_chars":16384,"cell_head_chars":4096},"cells_cut":0,"cells_raw":0,"read":"whole","date_system":"1900"}

{"sheet":"Tables","index":0,"n_rows":51,"n_cols":133,"rows_kept":51,"cut":false,"hidden":true,"merged":[]}
[null,"Named Range:",null,"type234",null,null,null,null,"Named Range:","Type2345",null,null,null,null,null,null,null,"Named Range:","Type123",null,null,null,null,null,null,null,"Named Range:","Side12",null,null,null,null,"Named Range:","Side23",null,null,null,null,null,null,null,null,null,"Man list for drop down",null,null,null,null,null,null,"Named Range:",null,"Named Range:",null,"manmod",null,null,null,null,null,null,null,null,null,null,null,null,null,null,null,null,"Dependant drop down ranges",null,null,null,null,null,null,null,null,null,null,null,null,null,null,null,null,null,null,null,null,null,null,null,null,null,null,null,null,null,"Named Range:","SIDE",null,null,null,"Drop Down options",null,null,null,"Named Range:","AbsenP",null,null,null,null,null,null,null,"Named Range:","MFGSER"]
[null,"1x2, 1x3, 1x4",null,"y",null,null,null,null,"1x2, 1x3, 1x4, 1x5","x",null,null,null,null,null,null,null,"1x1, 1x2, 1x3 ","z",null,null,null,null,null,null,null,"1high & 2high",null,null,null,null,null,"2high & 3high",null,null,null,null,null,null,null,null,null,null,null,null,null,null,null,null,null,"1x2, 1x3, 1x4",null,null,null,null,null,null,null,null,null,null,null,null,null,null,null,null,null,null,null,null,null,null,null,null,null,null,null,null,null,null,null,null,null,null,null,null,null,null,null,null,null,null,null,null,null,null,null,null,null,null,"1x1, 1x2, 1x3",null,null,null,null,null,null,null,null,null,"for part lookup"]
[null,null,null,null,null,null,null,null,null,null,null,null,null,null,null,null,null,null,null,null,null,null,null,null,null,null,null,null,null,null,null,null,null,null,null,null,null,null,null,null,null,null,null,null,null,null,null,null,null,null,null,null,1,2,3,4,5,6,7]
[null,"Rows",5,4,3,2,1,"Connector",null,"Rows",5,4,3,2,1,"Connector",null,null,"Rows",5,4,3,2,1,"Connector",null,null,"Rows",3,2,1,null,null,"Rows",3,2,1,null,null,null,null,null,null,null,"Manufacturer dvLED Series",null,null,"Manufacturer dvLED Series","Series","Conc","Option ?",null,"Conc",5,4,3,2,1,"Conn",null,null,null,null,"Row COUNT",null,null,null,"SKU","MSRP",null,null,null,"SILICONCORE","LEYARD","ABSEN","SAMSUNG ","UNILUMIN","VANGUARD","NANOLUMENS","AOTO","BAKO","BARCO","CHAINZONE_IMPOSA","CHRISTIE","COLEDER","DELTA","DGX","DIGITAL","DISPLAY","ESDLUMEN","GLIC","INFI_LED","LG","LIGHTHOUSE","MITSUBISHI","PHILIPS","PixelFlex","VISUAL","YES_TECH",null,null,null,"Rows",2,3,null,"Select"]
[{"$f":"(D5*$D$4)+(E5*$E$4)+(F5*$F$4)","v":0},1,null,null,null,null,null,null,null,1,null,null,null,null,null,null,null,null,1,null,null,null,null,1,{"$f":"SUM(T5:X5)-1","v":0},null,null,1,null,null,1,null,{"$f":"($AE$4*AE5)+($AD$4*AD5)+($AC$4*AC5)","v":1},1,null,null,null,null,{"$f":"($AK$4*AK5)+($AJ$4*AJ5)+($AI$4*AI5)","v":0},null,null,null,null,null,"UNILUMIN",null,null,"ABSEN","Acclaim","ABSEN Acclaim","",null,"Absen Acclaim",null,"TIL1X4AA","TIL1X3AA","TIL1X2AA","-","TILVABAA",null,null,null,null,"?",null,null,null,"-",null,null,null,null,"CAMELLIA","TVF","Acclaim","IFH","Upanel S","CERIUM","ENGAGE SERIES","CLD","BFP","XT","LPR","LED","ACE BLOCK","FE","DL","PROJECTION RADIANCE","LAMP","EHP","P","IL","LAS","Q","VS","9000 Series 27BDL","Fxe","LEADER","MC",null,null,1,1,null,null,null,"Yes",null,null,null,"ABSEN Acclaim Plus","TIL1X5AP","TIL1X4AP","TIL1X3AP","TIL1X2AP",null,"TILVABA1",null,null,1,2,3,4,5,6,7,8,9,10,11,12,13,14]
[{"$f":"(D6*$D$4)+(E6*$E$4)+(F6*$F$4)","v":2},2,null,null,null,1,null,{"$f":"SUM(D6:F6)-1","v":0},null,2,null,null,null,1,null,0,null,null,2,null,null,null,1,null,{"$f":"SUM(T6:X6)-1","v":0},null,null,2,null,1,null,null,{"$f":"($AE$4*AE6)+($AD$4*AD6)+($AC$4*AC6)","v":2},2,null,1,null,null,{"$f":"($AE$4*AK6)+($AD$4*AJ6)+($AC$4*AI6)","v":2},null,null,null,null,null,"ABSEN",null,null,"UNILUMIN","Upanel S","UNILUMIN Upanel S","",null,"Leyard TVF",null,"TIL1X4PT","TIL1X3PT","TIL1X2PT","-","TILVABPT",null,null,null,null,1,null,null,null,0,null,null,null,null,"DAFFODIL","CLA","Acclaim Plus","IFJ","UPANEL","IRIDIUM","NIXEL SERIES",null,null,null,null,null,null,null,null,null,null,null,null,null,"LAA",null,null,null,null,null,null,null,null,2,2,1,null,null,"No",null,null,null,"ABSEN Acclaim Pro","TIL1X5AP","TIL1X4AP","TIL1X3AP","TIL1X2AP",null,"TILVABA1",null,null,"Conc",5,4,3,2,1,"Conn","Type2345","Type234","Type123","Table Type",3,2,1]
[3,3,null,null,1,null,null,{"$f":"SUM(D7:F7)-1","v":0},null,3,null,null,1,null,null,0,null,null,3,null,null,1,null,null,0,null,null,3,null,1,1,null,3,3,1,null,null,null,3,null,null,null,null,null,"BARCO",null,null,"LEYARD","TVF","LEYARD TVF","",null,"LG LAS",null,"TIL1X4PT","TIL1X3PT","TIL1X2PT","-","TILVABPT",null,null,null,null,2,null,null,null,"TIL1X1IF",519,null,null,null,"LAVENDER","DL2","Acclaim Pro","IWJ","USLIM","RHODIUM",null,null,null,null,null,null,null,null,null,null,null,null,null,null,"LAP",null,null,null,null,null,null,null,null,3,3,null,1,null,null,null,null,null,null,null,null,null,null,null,null,null,null,"Absen Acclaim",null,"TIL1X4AA","TIL1X3AA","TIL1X2AA",null,"TILVABAA",null,"Y",null,{"$f":"DX7","v":"Y"}]
[4,4,null,1,null,null,null,0,null,4,null,1,null,null,null,0,null,null,4,null,null,null,2,null,1,null,null,4,null,2,null,null,4,4,null,2,null,null,4,null,null,null,null,null,"SAMSUNG",null,null,"LG","LAS","LG LAS","",null,"Unilumin Upanel S",null,"TIL1X4UU","TIL1X3UU","TIL1X2UU","-","TILVABUU",null,null,null,null,3,null,null,null,"TIL1X2AA",599,null,null,null,"LILY","TWA","N PLUS",null,null,null,null,null,null,null,null,null,null,null,null,null,null,null,null,null,null,null,null,null,null,null,null,null,null,4,4,2,null,null,null,null,null,null,null,null,null,null,null,null,null,null,null,"ABSEN Acclaim Plus","TIL1X5AP","TIL1X4AP","TIL1X3AP","TIL1X2AP",null,"TILVAB1","X",null,null,"x","TILSC3HAP","TILSC2HAP"]
[5,5,null,null,1,1,null,1,null,5,1,null,null,null,null,0,null,null,5,null,null,1,1,null,1,null,null,5,null,2,1,null,5,5,1,1,null,null,5,null,null,null,null,null,"LG",null,null,"SAMSUNG","IFH","SAMSUNG IFH","",null,"Samsung IFH",null,null,"TIL1X3IFH","TIL1X2IFH","TIL1X1IFH","TILVABIF",null,null,null,null,4,null,null,null,"TIL1X2IF",759,null,null,null,"MAGNOLIA",null,null,null,null,null,null,null,null,null,null,null,null,null,null,null,null,null,null,null,null,null,null,null,null,null,null,null,null,5,5,1,1,null,null,null,null,null,null,null,null,null,null,null,null,null,null,"ABSEN Acclaim Pro","TIL1X5AP","TIL1X4AP","TIL1X3AP","TIL1X2AP",null,"TILVAB1","x",null,null,"x","TILSC3HAP","TILSC2HAP"]
[6,6,null,null,2,null,null,1,null,6,null,null,2,null,null,1,null,null,6,null,null,2,null,null,1,null,null,6,null,3,null,null,6,6,2,null,null,null,6,null,null,null,null,null,"PHILIPS",null,null,"BARCO","XT","BARCO XT","",null,"Barco XT",null,"TIL1X4UU","TIL1X3UU","TIL1X2UU",null,"TILVABUU",null,null,null,null,5,null,null,null,"TIL1X2PT",599,null,null,null,"ORCHID HD",null,null,null,null,null,null,null,null,null,null,null,null,null,null,null,null,null,null,null,null,null,null,null,null,null,null,null,null,6,6,null,2,null,"Small","Chief PAC525",null,null,null,null,null,null,null,null,null,null,null,"Leyard TVF",null,"TIL1X4PT","TIL1X3PT","TIL1X2PT",null,"TILVABPT",null,"Y",null,"y","TILSC3HPT","TILSC2HPT"]
[7,7,null,1,1,null,null,1,null,7,null,1,1,null,null,1,null,null,7,null,null,1,null,1,1,null,null,7,null,3,1,null,7,7,1,2,null,null,7,null,null,null,null,null,"AOTO",null,null,"ABSEN","Acclaim Plus","ABSEN Acclaim Plus","",null,null,null,null,null,null,null,null,null,null,null,null,6,null,null,null,"TIL1X2PT",599,null,null,null,null,null,null,null,null,null,null,null,null,null,null,null,null,null,null,null,null,null,null,null,null,null,null,null,null,null,null,null,null,7,7,2,1,null,"Medium","Chief PAC526",null,null,null,null,null,null,null,null,null,null,null,"LG LAS",null,"TIL1X4PT","TIL1X3PT","TIL1X2PT",null,"TILVABPT",null,"Y",null,"y","TILSC3HPT","TILSC2HPT"]
[8,8,null,2,null,null,null,1,null,8,null,2,null,null,null,1,null,null,8,null,null,2,1,null,2,null,null,8,null,4,null,null,8,8,2,1,null,null,8,null,null,null,null,null,"LEYARD",null,null,"ABSEN","Acclaim Pro","ABSEN Acclaim Pro","",null,null,null,null,null,null,null,null,null,null,null,null,7,null,null,null,"TIL1X2UU",599,null,null,null,null,null,null,null,null,null,null,null,null,null,null,null,null,null,null,null,null,null,null,null,null,null,null,null,null,null,null,null,null,8,8,1,2,null,"Large","Chief PAC527",null,null,null,null,null,null,null,null,null,null,null,"Unilumin Upanel S","TIL1X5UU","TIL1X4UU","TIL1X3UU","TIL1X2UU",null,"TILVABUU",null,"Y",null,"x","TILSC3HUU","TILSC2HUU"]
[9,9,null,1,1,1,null,2,null,9,1,1,null,null,null,1,null,null,9,null,null,3,null,null,2,null,null,9,null,4,1,null,9,9,3,null,null,null,9,null,null,null,null,null,"CHAINZONE-IMPOSA",null,null,"ABSEN","N PLUS","ABSEN N PLUS","Please contact Chief Project Manager for available options (952)-225-6931 or send an email to lukas.westin@legrand.com",null,null,null,null,null,null,null,null,null,null,null,null,8,null,null,null,"TIL1X3AA",889,null,null,null,null,null,null,null,null,null,null,null,null,null,null,null,null,null,null,null,null,null,null,null,null,null,null,null,null,null,null,null,null,9,9,null,3,null,null,null,null,null,null,null,null,null,null,null,null,null,null,"Barco XT","TIL1X5UU","TIL1X4UU","TIL1X3UU","TIL1X2UU",null,"TILVABUU",null,"Y",null,"x","TILSC3HUU","TILSC2HUU"]
[10,10,null,2,null,1,null,2,null,10,2,null,null,null,null,1,null,null,10,null,null,3,null,1,3,null,null,10,null,5,null,null,10,10,2,2,null,null,10,null,null,null,null,null,"CHRISTIE",null,null,"AOTO","CLD","AOTO CLD","Please contact Chief Project Manager for available options (952)-225-6931 or send an email to lukas.westin@legrand.com",null,null,null,null,null,null,null,null,null,null,null,null,9,null,null,null,"TIL1X3IF",889,null,null,null,null,null,null,null,null,null,null,null,null,null,null,null,null,null,null,null,null,null,null,null,null,null,null,null,null,null,null,null,null,10,10,5,null,null,null,null,null,null,null,null,null,null,null,null,null,null,null,"Philips 9000 Series 27BDL","TIL1X5PH","TIL1X4PH","TIL1X3PH","TIL1X2PH",null,"TILVAB1","x",null,null,"x","TILSC3HPH","TILSC2HPH"]
[11,11,null,2,1,null,null,2,null,11,1,1,null,1,null,2,null,null,11,null,null,3,1,null,3,null,null,11,null,5,1,null,11,11,3,1,null,null,11,null,null,null,null,null,"COLEDER",null,null,"BAKO","BFP","BAKO BFP","Please contact Chief Project Manager for available options (952)-225-6931 or send an email to lukas.westin@legrand.com",null,null,null,null,null,null,null,null,null,null,null,null,10,null,null,null,"TIL1X3PT",889,null,null,null,null,null,null,null,null,null,null,null,null,null,null,null,null,null,null,null,null,null,null,null,null,null,null,null,null,null,null,null,null,11,11,1,3,null,null,null,null,null,null,null,null,null,null,null,null,null,null,"Samsung IFJ",null,"TIL1X4IFJ","TIL1X3IFJ","TIL1X2IFJ",null,"TILVAB1",null,"Y",null,"y"]
[12,12,null,3,null,null,null,2,null,12,null,3,null,null,null,2,null,null,12,null,null,4,null,null,3,null,null,12,null,6,null,null,12,12,4,null,null,null,12,null,null,null,null,null,"DELTA",null,null,"CHAINZONE/IMPOSA","LPR","CHAINZONE/IMPOSA LPR","Please contact Chief Project Manager for available options (952)-225-6931 or send an email to lukas.westin@legrand.com",null,null,null,null,null,null,null,null,null,null,null,null,11,null,null,null,"TIL1X3PT",889,null,null,null,null,null,null,null,null,null,null,null,null,null,null,null,null,null,null,null,null,null,null,null,null,null,null,null,null,null,null,null,null,12,12,6,null,null,null,null,null,null,null,null,null,null,null,null,null,null,null,"Samsung IFH",null,null,"TIL1X3IFH","TIL1X2IFH","TIL1X1IFH","TILVAB1",null,null,"Z","z",null,"TILSC2HIFH","TILSC1HIFH"]
[13,13,null,2,1,1,null,3,null,13,2,null,1,null,null,2,null,null,13,null,null,4,null,1,4,null,null,13,null,6,1,null,13,13,3,2,null,null,13,null,null,null,null,null,"DGX",null,null,"CHRISTIE","LED","CHRISTIE LED","Please contact Chief Project Manager for available options (952)-225-6931 or send an email to lukas.westin@legrand.com",null,null,2,3,4,5,"Connector",null,null,null,null,null,12,null,null,null,"TIL1X3UU",889,null,null,null,null,null,null,null,null,null,null,null,null,null,null,null,null,null,null,null,null,null,null,null,null,null,null,null,null,null,null,null,null,13,13,2,3]
[14,14,null,3,null,1,null,3,null,14,2,1,null,null,null,2,null,null,14,null,null,4,1,null,4,null,null,14,null,7,null,null,14,14,4,1,null,null,14,null,null,null,null,null,"DIGITAL",null,null,"COLEDER","ACE BLOCK","COLEDER ACE BLOCK","Please contact Chief Project Manager for available options (952)-225-6931 or send an email to lukas.westin@legrand.com",null,null,"TIL1X2AP","TIL1X3AP","TIL1X4AP","TIL1X5AP","TILVABA1",null,null,null,null,null,13,null,null,null,"TIL1X4AA",1089,null,null,null,null,null,null,null,null,null,null,null,null,null,null,null,null,null,null,null,null,null,null,null,null,null,null,null,null,null,null,null,null,14,14,7]
[15,15,null,3,1,null,null,3,null,15,3,null,null,null,null,2,null,null,15,null,null,5,null,null,4,null,null,15,null,7,1,null,15,15,5,null,null,null,15,null,null,null,null,null,"DISPLAY",null,null,"DELTA","FE","DELTA FE","Please contact Chief Project Manager for available options (952)-225-6931 or send an email to lukas.westin@legrand.com",null,null,null,null,null,null,null,null,null,null,null,null,14,null,null,null,"TIL1X4PT",1089,null,null,null,null,null,null,null,null,null,null,null,null,null,null,null,null,null,null,null,null,null,null,null,null,null,null,null,null,null,null,null,null,15,15,null,5]
[16,16,null,4,null,null,null,3,null,16,null,4,null,null,null,3,null,null,16,null,null,5,null,1,5,null,null,16,null,8,null,null,16,16,4,2,null,null,16,null,null,null,null,null,"ESDLUMEN",null,null,"DGX","DL","DGX DL","Please contact Chief Project Manager for available options (952)-225-6931 or send an email to lukas.westin@legrand.com",null,null,null,null,null,null,null,null,null,null,null,null,15,null,null,null,"TIL1X4PT",1089,null,null,null,null,null,null,null,null,null,null,null,null,null,null,null,null,null,null,null,null,null,null,null,null,null,null,null,null,null,null,null,null,16,16,8]
[17,17,null,3,1,1,null,4,null,17,3,null,null,1,null,3,null,null,17,null,null,5,1,null,5,null,null,17,null,8,1,null,17,17,3,4,null,null,17,null,null,null,null,null,"GLIC",null,null,"DIGITAL","PROJECTION RADIANCE","DIGITAL PROJECTION RADIANCE","Please contact Chief Project Manager for available options (952)-225-6931 or send an email to lukas.westin@legrand.com",null,null,null,null,null,null,null,null,null,null,null,null,16,null,null,null,"TIL1X4UU",1089,null,null,null,null,null,null,null,null,null,null,null,null,null,null,null,null,null,null,null,null,null,null,null,null,null,null,null,null,null,null,null,null,17,17,4,3]
[18,18,null,4,null,1,null,4,null,18,null,4,null,1,null,4,null,null,18,null,null,6,null,null,5,null,null,18,null,9,null,null,18,18,6,null,null,null,18,null,null,null,null,null,"INFI_LED",null,null,"DISPLAY","LAMP","DISPLAY LAMP","Please contact Chief Project Manager for available options (952)-225-6931 or send an email to lukas.westin@legrand.com",null,null,null,null,null,null,null,null,null,null,null,null,17,null,null,null,"TILVABAA",49,null,null,null,null,null,null,null,null,null,null,null,null,null,null,null,null,null,null,null,null,null,null,null,null,null,null,null,null,null,null,null,null,18,18,6,2]
[19,19,null,4,1,null,null,4,null,19,3,1,null,null,null,3,null,null,19,null,null,6,null,1,6,null,null,19,null,9,1,null,19,19,5,2,null,null,19,null,null,null,null,null,"LIGHTHOUSE",null,null,"ESDLUMEN","EHP","ESDLUMEN EHP","Please contact Chief Project Manager for available options (952)-225-6931 or send an email to lukas.westin@legrand.com",null,null,null,null,null,null,null,null,null,null,null,null,18,null,null,null,"TILVABIF",66,null,null,null,null,null,null,null,null,null,null,null,null,null,null,null,null,null,null,null,null,null,null,null,null,null,null,null,null,null,null,null,null,19,19,2,5]
[20,20,null,5,null,null,null,4,null,20,4,null,null,null,null,3,null,null,20,null,null,6,1,null,6,null,null,20,null,10,null,null,20,20,6,1,null,null,20,null,null,null,null,null,"MITSUBISHI",null,null,"GLIC","P","GLIC P","Please contact Chief Project Manager for available options (952)-225-6931 or send an email to lukas.westin@legrand.com",null,null,null,null,null,null,null,null,null,null,null,null,19,null,null,null,"TILVABPT",49,null,null,null,null,null,null,null,null,null,null,null,null,null,null,null,null,null,null,null,null,null,null,null,null,null,null,null,null,null,null,null,null,20,20,4,4]
[21,21,null,4,1,1,null,5,null,21,1,4,null,null,null,4,null,null,21,null,null,7,null,null,6,null,null,21,null,10,1,null,21,21,7,null,null,null,21,null,null,null,null,null,"NANOLUMENS",null,null,"INFI LED","IL","INFI LED IL","Please contact Chief Project Manager for available options (952)-225-6931 or send an email to lukas.westin@legrand.com",null,null,null,null,null,null,null,null,null,null,null,null,20,null,null,null,"TILVABPT",49,null,null,null,null,null,null,null,null,null,null,null,null,null,null,null,null,null,null,null,null,null,null,null,null,null,null,null,null,null,null,null,null,21,21,3,5]
[22,22,null,5,null,1,null,5,null,22,4,null,null,1,null,4,null,null,22,null,null,7,null,1,7,null,null,22,null,11,null,null,22,22,6,2,null,null,22,null,null,null,null,null,"BAKO",null,null,"LEYARD","CLA","LEYARD CLA","Please contact Chief Project Manager for available options (952)-225-6931 or send an email to lukas.westin@legrand.com",null,null,null,null,null,null,null,null,null,null,null,null,21,null,null,null,"TILVABUU",49,null,null,null,null,null,null,null,null,null,null,null,null,null,null,null,null,null,null,null,null,null,null,null,null,null,null,null,null,null,null,null,null,22,22,5,4]
[23,23,null,5,1,null,null,5,null,23,4,null,1,null,null,4,null,null,23,null,null,7,1,null,7,null,null,23,null,11,1,null,23,23,7,1,null,null,23,null,null,null,null,null,"PixelFlex",null,null,"LEYARD","DL2","LEYARD DL2","Please contact Chief Project Manager for available options (952)-225-6931 or send an email to lukas.westin@legrand.com",null,null,null,null,null,null,null,null,null,null,null,null,22,null,null,null,null,null,null,null,null,null,null,null,null,null,null,null,null,null,null,null,null,null,null,null,null,null,null,null,null,null,null,null,null,null,null,null,null,null,23,23,7,3]
[24,24,null,6,null,null,null,5,null,24,4,1,null,null,null,4,null,null,24,null,null,8,null,null,7,null,null,24,null,12,null,null,24,24,8,null,null,null,24,null,null,null,null,null,"SILICONCORE",null,null,"LEYARD","TWA","LEYARD TWA","Please contact Chief Project Manager for available options (952)-225-6931 or send an email to lukas.westin@legrand.com",null,null,null,null,null,null,null,null,null,null,null,null,23,null,null,null,null,null,null,null,null,null,null,null,null,null,null,null,null,null,null,null,null,null,null,null,null,null,null,null,null,null,null,null,null,null,null,null,null,null,24,24,6,4]
[25,25,null,5,1,1,null,6,null,25,5,null,null,null,null,4,null,null,25,null,null,8,null,1,8,null,null,25,null,12,1,null,25,25,7,2,null,null,25,null,null,null,null,null,"VANGUARD",null,null,"LG","LAA","LG LAA","Please contact Chief Project Manager for available options (952)-225-6931 or send an email to lukas.westin@legrand.com",null,null,null,null,null,null,null,null,null,null,null,null,24,null,null,null,null,null,null,null,null,null,null,null,null,null,null,null,null,null,null,null,null,null,null,null,null,null,null,null,null,null,null,null,null,null,null,null,null,null,25,25,5,5]
[26,26,null,6,null,1,null,6,null,26,4,1,null,1,null,5,null,null,26,null,null,8,null,1,8,null,null,26,null,13,null,null,26,26,6,4,null,null,26,null,null,null,null,null,"VISUAL",null,null,"LG","LAP","LG LAP","Please contact Chief Project Manager for available options (952)-225-6931 or send an email to lukas.westin@legrand.com",null,null,null,null,null,null,null,null,null,null,null,null,25,null,null,null,null,null,null,null,null,null,null,null,null,null,null,null,null,null,null,null,null,null,null,null,null,null,null,null,null,null,null,null,null,null,null,null,null,null,26,26,4,6]
[27,27,null,6,1,null,null,6,null,27,5,null,null,1,null,5,null,null,27,null,null,9,null,null,8,null,null,27,null,13,1,null,27,27,9,null,null,null,27,null,null,null,null,null,"YES_TECH",null,null,"LIGHTHOUSE","Q","LIGHTHOUSE Q","Please contact Chief Project Manager for available options (952)-225-6931 or send an email to lukas.westin@legrand.com",null,null,null,null,null,null,null,null,null,null,null,null,26,null,null,null,null,null,null,null,null,null,null,null,null,null,null,null,null,null,null,null,null,null,null,null,null,null,null,null,null,null,null,null,null,null,null,null,null,null,27,27,6,5]
[28,28,null,7,null,null,null,6,null,28,5,null,1,null,null,5,null,null,28,null,null,9,null,1,9,null,null,28,null,14,null,null,28,28,8,2,null,null,28,null,null,null,null,null,null,null,null,"MITSUBISHI","VS","MITSUBISHI VS","Please contact Chief Project Manager for available options (952)-225-6931 or send an email to lukas.westin@legrand.com",null,null,null,null,null,null,null,null,null,null,null,null,27,null,null,null,null,null,null,null,null,null,null,null,null,null,null,null,null,null,null,null,null,null,null,null,null,null,null,null,null,null,null,null,null,null,null,null,null,null,28,28,8,4]
[29,29,null,6,1,1,null,7,null,29,5,1,null,null,null,5,null,null,29,null,null,9,1,null,9,null,null,29,null,14,1,null,29,29,7,4,null,null,29,null,null,null,null,null,null,null,null,"NANOLUMENS","ENGAGE SERIES","NANOLUMENS ENGAGE SERIES","Please contact Chief Project Manager for available options (952)-225-6931 or send an email to lukas.westin@legrand.com",null,null,null,null,null,null,null,null,null,null,null,null,28,null,null,null,null,null,null,null,null,null,null,null,null,null,null,null,null,null,null,null,null,null,null,null,null,null,null,null,null,null,null,null,null,null,null,null,null,null,29,29,4,7]
[30,30,null,7,null,1,null,7,null,30,6,null,null,null,null,5,null,null,30,null,null,10,null,null,9,null,null,30,null,15,null,null,30,30,10,null,null,null,30,null,null,null,null,null,null,null,null,"NANOLUMENS","NIXEL SERIES","NANOLUMENS NIXEL SERIES","Please contact Chief Project Manager for available options (952)-225-6931 or send an email to lukas.westin@legrand.com",null,null,null,null,null,null,null,null,null,null,null,null,29,null,null,null,null,null,null,null,null,null,null,null,null,null,null,null,null,null,null,null,null,null,null,null,null,null,null,null,null,null,null,null,null,null,null,null,null,null,30,30,6,6]
[null,null,null,null,null,null,null,null,null,null,null,null,null,null,null,null,null,null,null,null,null,null,null,null,null,null,null,null,null,null,null,null,null,null,null,null,null,null,null,null,null,null,null,null,null,null,null,"PHILIPS","9000 Series 27BDL","PHILIPS 9000 Series 27BDL","",null,null,null,null,null,null,null,null,null,null,null,null,30]
[null,null,null,null,null,null,null,null,null,null,null,null,null,null,null,null,null,null,null,null,null,null,null,null,null,null,null,null,null,null,null,null,null,null,null,null,null,null,null,null,null,null,null,null,null,null,null,"PixelFlex","Fxe","PixelFlex Fxe","Please contact Chief Project Manager for available options (952)-225-6931 or send an email to lukas.westin@legrand.com"]
[null,null,null,null,null,null,null,null,null,null,null,null,null,null,null,null,null,null,null,null,null,null,null,null,null,null,null,null,null,null,null,null,null,null,null,null,null,null,null,null,null,null,null,null,null,null,null,"SAMSUNG","IFJ","SAMSUNG IFJ",""]
[null,null,null,null,null,null,null,null,null,null,null,null,null,null,null,null,null,null,null,null,null,null,null,null,null,null,null,null,null,null,null,null,null,null,null,null,null,null,null,null,null,null,null,null,null,null,null,"SAMSUNG","IFW","SAMSUNG IWJ","Please contact Chief Project Manager for available options (952)-225-6931 or send an email to lukas.westin@legrand.com"]
[null,null,null,null,null,null,null,null,null,null,null,null,null,null,null,null,null,null,null,null,null,null,null,null,null,null,null,null,null,null,null,null,null,null,null,null,null,null,null,null,null,null,null,null,null,null,null,"SILICONCORE","CAMELLIA","SILICONCORE CAMELLIA","Please contact Chief Project Manager for available options (952)-225-6931 or send an email to lukas.westin@legrand.com"]
[null,null,null,null,null,null,null,null,null,null,null,null,null,null,null,null,null,null,null,null,null,null,null,null,null,null,null,null,null,null,null,null,null,null,null,null,null,null,null,null,null,null,null,null,null,null,null,"SILICONCORE","DAFFODIL","SILICONCORE DAFFODIL","Please contact Chief Project Manager for available options (952)-225-6931 or send an email to lukas.westin@legrand.com"]
[null,null,null,null,null,null,null,null,null,null,null,null,null,null,null,null,null,null,null,null,null,null,null,null,null,null,null,null,null,null,null,null,null,null,null,null,null,null,null,null,null,null,null,null,null,null,null,"SILICONCORE","LAVENDER","SILICONCORE LAVENDER","Please contact Chief Project Manager for available options (952)-225-6931 or send an email to lukas.westin@legrand.com"]
[null,null,null,null,null,null,null,null,null,null,null,null,null,null,null,null,null,null,null,null,null,null,null,null,null,null,null,null,null,null,null,null,null,null,null,null,null,null,null,null,null,null,null,null,null,null,null,"SILICONCORE","LILY","SILICONCORE LILY","Please contact Chief Project Manager for available options (952)-225-6931 or send an email to lukas.westin@legrand.com"]
[null,null,null,null,null,null,null,null,null,null,null,null,null,null,null,null,null,null,null,null,null,null,null,null,null,null,null,null,null,null,null,null,null,null,null,null,null,null,null,null,null,null,null,null,null,null,null,"SILICONCORE","MAGNOLIA","SILICONCORE MAGNOLIA","Please contact Chief Project Manager for available options (952)-225-6931 or send an email to lukas.westin@legrand.com"]
[null,null,null,null,null,null,null,null,null,null,null,null,null,null,null,null,null,null,null,null,null,null,null,null,null,null,null,null,null,null,null,null,null,null,null,null,null,null,null,null,null,null,null,null,null,null,null,"SILICONCORE","ORCHID HD","SILICONCORE ORCHID HD","Please contact Chief Project Manager for available options (952)-225-6931 or send an email to lukas.westin@legrand.com"]
[null,null,null,null,null,null,null,null,null,null,null,null,null,null,null,null,null,null,null,null,null,null,null,null,null,null,null,null,null,null,null,null,null,null,null,null,null,null,null,null,null,null,null,null,null,null,null,"UNILUMIN","UPANEL","UNILUMIN UPANEL","Please contact Chief Project Manager for available options (952)-225-6931 or send an email to lukas.westin@legrand.com"]
[null,null,null,null,null,null,null,null,null,null,null,null,null,null,null,null,null,null,null,null,null,null,null,null,null,null,null,null,null,null,null,null,null,null,null,null,null,null,null,null,null,null,null,null,null,null,null,"UNILUMIN","USLIM","UNILUMIN USLIM","Please reference USLIM Configure Tool tab"]
[null,null,null,null,null,null,null,null,null,null,null,null,null,null,null,null,null,null,null,null,null,null,null,null,null,null,null,null,null,null,null,null,null,null,null,null,null,null,null,null,null,null,null,null,null,null,null,"VANGUARD","CERIUM","VANGUARD CERIUM","Please contact Chief Project Manager for available options (952)-225-6931 or send an email to lukas.westin@legrand.com"]
[null,null,null,null,null,null,null,null,null,null,null,null,null,null,null,null,null,null,null,null,null,null,null,null,null,null,null,null,null,null,null,null,null,null,null,null,null,null,null,null,null,null,null,null,null,null,null,"VANGUARD","IRIDIUM","VANGUARD IRIDIUM","Please contact Chief Project Manager for available options (952)-225-6931 or send an email to lukas.westin@legrand.com"]
[null,null,null,null,null,null,null,null,null,null,null,null,null,null,null,null,null,null,null,null,null,null,null,null,null,null,null,null,null,null,null,null,null,null,null,null,null,null,null,null,null,null,null,null,null,null,null,"VANGUARD","RHODIUM","VANGUARD RHODIUM","Please contact Chief Project Manager for available options (952)-225-6931 or send an email to lukas.westin@legrand.com"]
[null,null,null,null,null,null,null,null,null,null,null,null,null,null,null,null,null,null,null,null,null,null,null,null,null,null,null,null,null,null,null,null,null,null,null,null,null,null,null,null,null,null,null,null,null,null,null,"VISUAL","LEADER","VISUAL LEADER","Please contact Chief Project Manager for available options (952)-225-6931 or send an email to lukas.westin@legrand.com"]
[null,null,null,null,null,null,null,null,null,null,null,null,null,null,null,null,null,null,null,null,null,null,null,null,null,null,null,null,null,null,null,null,null,null,null,null,null,null,null,null,null,null,null,null,null,null,null,"YES TECH","MC","YES TECH MC","Please contact Chief Project Manager for available options (952)-225-6931 or send an email to lukas.westin@legrand.com"]

{"sheet":"Configure Tool","index":1,"n_rows":39,"n_cols":38,"rows_kept":39,"cut":false,"hidden":false,"merged":[[8,2,8,4],[4,1,4,4],[12,1,12,3]]}
[]
[]
[]
[]
[null,"TiLED Part Number Configurator"]
[null,null,null,null,{"$f":"+C8&\" \"&E8","v":"UNILUMIN Upanel S"}]
[null,null,null,null,{"$f":"IFERROR(VLOOKUP(E6,MFGSER,11,FALSE),\"\")","v":"x"},"acclaim p"]
[null,"Select Manufacturer","UNILUMIN","Select dvLED Series","Upanel S",null,null,null,{"$f":"+B12","v":5},{"$f":"+C12-1","v":4},{"$f":"+J8-1","v":3},2,1,0,-1,-2,-3,-4,-5,-6,-7,-8,-9,-10,-11,-12,-13,-14,-15,-16,-17,-18,-19,-20,-21,-22,-23,-24]
[null,{"$f":"IF(C9=\"Please Call Chief Project Manager for available options.  (952)-225-6931\",\"X\",\"Z\")","v":"Z"},{"$f":"VLOOKUP(E6,CALL,2,FALSE)","v":""},null,null,null,null,null,{"$f":"+I8-1","v":4},{"$f":"+(J8>0.99)","v":true},true,true,true,false,false,false,false,false,false,false,false,false,false,false,false,false,false,false,false,false,false,false,false,false,false,false,false,false]
[null,null,null,null,null,null,null,null,{"$f":"+I9-1","v":3},{"$f":"+I10>0.99","v":true},{"$f":"IF((AND(K9=TRUE, J10=TRUE)), TRUE, FALSE)","v":true},true,true,false,false,false,false,false,false,false,false,false,false,false,false,false,false,false,false,false,false,false,false,false,false,false,false,false]
[null,"How Many Rows?\n(How many TiLES high?)","How Many Columns?\n(How many TiLES wide?)",null,null,null,null,null,2,true,true,{"$f":"IF((AND(L10=TRUE, K11=TRUE)), TRUE, FALSE)","v":true},true,false,false,false,false,false,false,false,false,false,false,false,false,false,false,false,false,false,false,false,false,false,false,false,false,false]
[null,5,5,null,null,null,null,null,1,true,true,true,true,false,false,false,false,false,false,false,false,false,false,false,false,false,false,false,false,false,false,false,false,false,false,false,false,false]
[null,"For configuations taller than 10 displays high contact Chief Project Manager at (952)-225-6931 or send an email to lukas.westin@legrand.com",null,null,null,null,null,null,0,false,false,false,false,false,false,false,false,false,false,false,false,false,false,false,false,false,false,false,false,false,false,false,false,false,false,false,false,false]
[null,null,null,null,null,null,null,null,-1,false,false,false,false,false,false,false,false,false,false,false,false,false,false,false,false,false,false,false,false,false,false,false,false,false,false,false,false,false]
[null,"Wall Mount Part #","Qty",null,"Side Cover Part #","Qty",null,null,-2,false,false,false,false,false,false,false,false,false,false,false,false,false,false,false,false,false,false,false,false,false,false,false,false,false,false,false,false,false]
[null,{"$f":"VLOOKUP(E6,MFGSER,2,FALSE)","v":"TIL1X5UU"},{"$f":"IF($E$7=\"X\",VLOOKUP($B$12,type2345,2,FALSE),IF($E$7=\"y\",VLOOKUP($B$12,type234,2,FALSE),IF($E$7=\"Z\",VLOOKUP($B$12,type123,2,FALSE))))*C12","v":5},null,{"$f":"IFERROR(VLOOKUP(E6,MFGSER,12,FALSE),\"\")","v":"TILSC3HUU"},{"$f":"IF($E$7=\"X\",VLOOKUP($B$12,Side23,2,FALSE),IF($E$7=\"y\",VLOOKUP($B$12,Side23,2,FALSE),IF($E$7=\"Z\",VLOOKUP($B$12,Side12,2,FALSE))))","v":1},null,null,-3,false,false,false,false,false,false,false,false,false,false,false,false,false,false,false,false,false,false,false,false,false,false,false,false,false,false,false,false,false]
[null,{"$f":"VLOOKUP(E6,MFGSER,3,FALSE)","v":"TIL1X4UU"},{"$f":"IF($E$7=\"X\",VLOOKUP($B$12,type2345,3,FALSE),IF($E$7=\"y\",VLOOKUP($B$12,type234,3,FALSE),IF($E$7=\"Z\",VLOOKUP($B$12,type123,3,FALSE))))*C12","v":0},null,{"$f":"IFERROR(VLOOKUP(E6,MFGSER,13,FALSE),\"\")","v":"TILSC2HUU"},{"$f":"IF($E$7=\"X\",VLOOKUP($B$12,Side23,3,FALSE),IF($E$7=\"y\",VLOOKUP($B$12,Side23,3,FALSE),IF($E$7=\"Z\",VLOOKUP($B$12,Side12,3,FALSE))))","v":1},null,null,-4,false,false,false,false,false,false,false,false,false,false,false,false,false,false,false,false,false,false,false,false,false,false,false,false,false,false,false,false,false]
[null,{"$f":"VLOOKUP(E6,MFGSER,4,FALSE)","v":"TIL1X3UU"},{"$f":"IF($E$7=\"X\",VLOOKUP($B$12,type2345,4,FALSE),IF($E$7=\"y\",VLOOKUP($B$12,type234,4,FALSE),IF($E$7=\"Z\",VLOOKUP($B$12,type123,4,FALSE))))*C12","v":0},null,{"$f":"IFERROR(VLOOKUP(E6,MFGSER,14,FALSE),\"\")","v":0},{"$f":"IF($E$7=\"X\",VLOOKUP($B$12,Side23,4,FALSE),IF($E$7=\"y\",VLOOKUP($B$12,Side23,4,FALSE),IF($E$7=\"Z\",VLOOKUP($B$12,Side12,4,FALSE))))","v":0},null,null,-5,false,false,false,false,false,false,false,false,false,false,false,false,false,false,false,false,false,false,false,false,false,false,false,false,false,false,false,false,false]
[null,{"$f":"VLOOKUP(E6,MFGSER,5,FALSE)","v":"TIL1X2UU"},{"$f":"IF($E$7=\"X\",VLOOKUP($B$12,type2345,5,FALSE),IF($E$7=\"y\",VLOOKUP($B$12,type234,5,FALSE),IF($E$7=\"Z\",VLOOKUP($B$12,type123,5,FALSE))))*C12","v":0},null,null,null,null,null,-6,false,false,false,false,false,{"$f":"IF((AND(O18=TRUE, N19=TRUE)), TRUE, FALSE)","v":false},false,false,false,false,false,false,false,false,false,false,false,false,false,false,false,false,false,false,false,false,false,false,false]
[null,{"$f":"VLOOKUP(E6,MFGSER,6,FALSE)","v":0},{"$f":"IF($E$7=\"X\",VLOOKUP($B$12,type2345,6,FALSE),IF($E$7=\"y\",VLOOKUP($B$12,type234,6,FALSE),IF($E$7=\"Z\",VLOOKUP($B$12,type123,6,FALSE))))*C12","v":0},null,null,null,null,null,-7,false,{"$f":"IF((AND(K19=TRUE, J20=TRUE)), TRUE, FALSE)","v":false},false,false,false,false,false,false,false,false,false,false,false,false,false,false,false,false,false,false,false,false,false,false,false,false,false,false,false]
[null,{"$f":"VLOOKUP(E6,MFGSER,7,FALSE)","v":"TILVABUU"},{"$f":"IF($E$7=\"X\",VLOOKUP($B$12,type2345,7,FALSE),IF($E$7=\"y\",VLOOKUP($B$12,type234,7,FALSE),IF($E$7=\"Z\",VLOOKUP($B$12,type123,7,FALSE))))*C12","v":0},null,null,null,null,null,-8,false,false,false,false,false,false,false,false,false,false,false,false,false,false,false,false,false,false,false,false,false,false,false,false,false,false,false,false,false]
[null,null,null,null,null,null,null,null,-9,false,false,false,false,false,false,false,false,false,false,false,false,false,false,false,false,false,false,false,false,false,false,false,false,false,false,false,false,false]
[null,null,null,null,null,null,null,null,-10,false,false,false,false,false,false,false,false,false,false,false,false,false,false,false,false,false,false,false,false,false,false,false,false,false,false,false,false,false]
[null,"legrandav.com/chief",null,null,null,null,null,null,-11,false,false,false,false,false,false,false,false,false,false,false,false,false,false,false,false,false,false,false,false,false,false,false,false,false,false,false,false,false]
[null,null,null,null,null,null,null,null,-12,false,false,false,false,false,false,false,false,false,false,false,false,false,false,false,false,false,false,false,false,false,false,false,false,false,false,false,false,false]
[{"$f":"+E18&F18","v":"00"},null,null,null,null,null,null,null,-13,false,false,false,false,false,false,false,false,false,false,false,false,false,false,false,false,false,false,false,false,false,false,false,false,false,false,false,false,false]
[{"$f":"+E18&F18","v":"00"},null,null,null,null,null,null,null,-14,false,false,false,false,false,false,false,false,false,false,false,false,false,false,false,false,false,false,false,false,false,false,false,false,false,false,false,false,false]
[{"$f":"+E18&F18","v":"00"},null,null,null,null,null,null,null,-15,false,false,false,false,false,false,false,false,false,false,false,false,false,false,false,false,false,false,false,false,false,false,false,false,false,false,false,false,false]
[null,null,null,null,null,null,null,null,-16,false,false,false,false,false,false,false,false,false,false,false,false,false,false,false,false,false,false,false,false,false,false,false,false,false,false,false,false,false]
[null,null,null,null,null,null,null,null,-17,false,false,false,false,false,false,false,false,false,false,false,false,false,false,false,false,false,false,false,false,false,false,false,false,false,false,false,false,false]
[null,null,null,null,null,null,null,null,-18,false,false,false,false,false,false,false,false,false,false,false,false,false,false,false,false,false,false,false,false,false,false,false,false,false,false,false,false,false]
[null,null,null,null,null,null,null,null,-19,false,false,false,false,false,false,false,false,false,false,false,false,false,false,false,false,false,false,false,false,false,false,false,false,false,false,false,false,false]
[null,null,null,null,null,null,null,null,-20,false,false,false,false,false,false,false,false,false,false,false,false,false,false,false,false,false,false,false,false,false,false,false,false,false,false,false,false,false]
[null,null,null,null,null,null,null,null,-21,false,false,false,false,false,false,false,false,false,false,false,false,false,false,false,false,false,false,false,false,false,false,false,false,false,false,false,false,false]
[null,null,null,null,null,null,null,null,-22,false,false,false,false,false,false,false,false,false,false,false,false,false,false,false,false,false,{"$f":"IF((AND(AA34=TRUE, Z35=TRUE)), TRUE, FALSE)","v":false},false,false,false,false,false,false,false,false,false,false,false]
[null,null,null,null,null,null,null,null,-23,false,{"$f":"IF((AND(K35=TRUE, J36=TRUE)), TRUE, FALSE)","v":false},false,false,false,false,false,false,false,false,false,false,false,false,false,false,false,false,false,false,false,false,false,false,false,false,false,false,false]
[null,null,null,null,null,null,null,null,-24,false,false,false,false,false,false,false,false,false,false,false,false,false,false,false,false,false,false,false,false,false,false,false,false,false,false,false,false,false]
[null,null,null,null,null,null,null,null,{"$f":"+I37-1","v":-25},{"$f":"+I38>0.99","v":false},{"$f":"IF((AND(K37=TRUE, J38=TRUE)), TRUE, FALSE)","v":false},false,false,false,false,false,false,false,false,false,{"$f":"IF((AND(U37=TRUE, T38=TRUE)), TRUE, FALSE)","v":false},false,false,false,false,false,false,false,false,false,{"$f":"IF((AND(AE37=TRUE, AD38=TRUE)), TRUE, FALSE)","v":false},false,false,false,false,false,false,false]
[null,null,null,null,null,null,null,null,{"$f":"+I38-1","v":-26},{"$f":"+I39>0.99","v":false},false,false,false,false,false,false,false,false,false,false,false,false,false,false,false,false,false,false,false,false,false,false,false,false,false,false,false,false]

{"sheet":"PANELS","index":2,"n_rows":358,"n_cols":35,"rows_kept":358,"cut":false,"hidden":true,"merged":[[2,34,5,34],[20,34,24,34],[100,18,103,18],[268,34,270,34],[0,18,1,18],[0,19,0,23],[0,24,0,28],[0,29,1,29],[0,30,0,33],[0,34,1,34],[0,17,1,17],[0,6,1,6],[0,7,1,7],[0,8,1,8],[0,9,1,9],[0,10,1,10],[0,11,1,11],[0,12,1,12],[0,13,1,13],[0,14,1,14],[0,15,1,15],[0,16,1,16],[0,5,1,5],[0,0,1,0],[0,1,1,1],[0,2,1,2],[0,3,1,3],[0,4,1,4]]}
["MANUFACTURER","MODEL NUMBER","HEIGHT (MM)","WIDTH (MM)","DEPTH (MM)","WEIGHT (KG)","HEIGHT (IN.)","WIDTH (IN.)","DEPTH (IN.)","WEIGHT (LBS.)","PIXEL PITCH","RATIO                                           .5625 = 16:9                                             1.33 = 4:3","SQUARE METERS","LED'S/M^2","FRONT SERVICABLE","REAR ACCESS ONLY","CHIEF MOUNT","VERT. CONN. KIT","REBRAND","MOUNTING PATTERN",null,null,null,null,"ASPECT RATIO SET UPS",null,null,null,null,"PIXEL \nMATRIX PER PANEL","RETAIL PRICING",null,null,null,"CLAMPING/ALIGNMENT"]
[null,null,null,null,null,null,null,null,null,null,null,null,null,null,null,null,null,null,null,"HEIGHT              (mm)","HEIGHT             (IN)","WIDTH   (mm)","WIDTH                        (IN)","SCREW SIZE (mm)","1920 X \n1080","2560 X \n1440","2880 X \n1620","3840 X \n2160","4800 X \n2700",null,"B&H","NEXT WAREHOUSE","NEUTRON USA","MANUFACTURER MSRP"]
["ABSEN","N2",288,576,57,6.4,{"$f":"C3/25.4","v":11.338582677165356},{"$f":"D3/25.4","v":22.677165354330711},2.2440944881889764,{"$f":"F3*2.2","v":14.080000000000002},2.4,{"$f":"C3/D3","v":0.5},{"$f":"C3*D3/1000000","v":0.16588800000000001},{"$f":"1/M3","v":6.0281635802469129},"X",null,null,null,null,null,null,null,null,null,null,null,null,null,null,"240 X 120",null,null,null,null,"ALIGNED WITH CLAMPING BLOCK.  SCREENS CLAMPED TOGETHER ON THE SIDES THEN CLAMPING BLOCK REMOVED. ALSO CLAMPED ON THE TOP AND BOTTOM OF THE SCREENS."]
["ABSEN","N3",288,864,54,7.1,11.338582677165356,34.015748031496067,2.1259842519685042,15.620000000000001,3.2,{"$f":"C4/D4","v":0.33333333333333331},0.248832,{"$f":"1/M4","v":4.0187757201646095},"X",null,null,null,null,null,null,null,null,null,null,null,null,null,null,"360 X 90"]
["ABSEN","N4",288,864,54,7.1,11.338582677165356,34.015748031496067,2.1259842519685042,15.620000000000001,4,0.33333333333333331,0.248832,4.0187757201646095,"X",null,null,null,null,null,null,null,null,null,null,null,null,null,null,"288 X 72"]
["ABSEN","N5",288,864,54,7.1,11.338582677165356,34.015748031496067,2.1259842519685042,15.620000000000001,5.14,0.33333333333333331,0.248832,4.0187757201646095,"X",null,null,null,null,null,null,null,null,null,null,null,null,null,null,"224 X 56"]
["ABSEN","N3 PLUS",288,1440,54,10,11.338582677165356,56.692913385826778,2.1259842519685042,22,3.2,0.2,0.41471999999999998,2.4112654320987654,"X"]
["ABSEN","N4 PLUS",288,1440,54,10,11.338582677165356,56.692913385826778,2.1259842519685042,22,4,0.2,0.41471999999999998,2.4112654320987654,"X"]
["ABSEN","N5 PLUS",288,1440,54,10,11.338582677165356,56.692913385826778,2.1259842519685042,22,5.14,0.2,0.41471999999999998,2.4112654320987654,"X"]
["ABSEN","HDV1.2",400,400,65,7,15.748031496062993,15.748031496062993,2.5590551181102366,15.400000000000002,1.25,1,0.16,6.25,"X"]
["ABSEN","HDV1.6",400,400,65,6.7,15.748031496062993,15.748031496062993,2.5590551181102366,14.740000000000002,1.67,1,0.16,6.25,"X"]
["ABSEN","HDV1.9",400,400,65,6.7,15.748031496062993,15.748031496062993,2.5590551181102366,14.740000000000002,1.92,1,0.16,6.25,"X"]
["ABSEN","A1.2",400,300,120,7.2,15.748031496062993,11.811023622047244,4.7244094488188981,15.840000000000002,1.25,1.3333333333333333,0.12,8.3333333333333339]
["ABSEN","A1.6",400,300,120,7.6,15.748031496062993,11.811023622047244,4.7244094488188981,16.72,1.6,1.3333333333333333,0.12,8.3333333333333339]
["ABSEN","A1.9",400,300,95,6.7,15.748031496062993,11.811023622047244,3.7401574803149606,14.740000000000002,1.9,1.3333333333333333,0.12,8.3333333333333339]
["ABSEN","A2712",343,610,61,8.5,13.503937007874017,24.015748031496063,2.4015748031496065,18.700000000000003,1.27,0.56229508196721312,0.20923,4.7794293361372651]
["ABSEN","A2725",343,610,60,8,13.503937007874017,24.015748031496063,2.3622047244094491,17.600000000000001,2.54,0.56229508196721312,0.20923,4.7794293361372651,"X"]
["ABSEN","A2719",343,610,60,8.5,13.503937007874017,24.015748031496063,2.3622047244094491,18.700000000000003,1.9,0.56229508196721312,0.20923,4.7794293361372651,"X"]
["ABSEN","A2715",343,610,60,8.5,13.503937007874017,{"$f":"D19/25.4","v":24.015748031496063},{"$f":"E19/25.4","v":2.3622047244094491},18.700000000000003,1.58,0.56229508196721312,0.20923,4.7794293361372651,"X"]
["ABSEN","M2.9",500,500,95,7.6,19.685039370078741,19.685039370078741,3.7401574803149606,16.72,2.97,1,0.25,4,"X"]
["ABSEN","ACCLAIM 1.2",343,610,61,8.5,13.503937007874017,24.015748031496063,2.4015748031496065,18.700000000000003,1.27,0.56229508196721312,0.20923,4.7794293361372651,"X",null,"TIL1XXAA, TIL1XXAP","TILVABAA",null,226,{"$f":"T21/25.4","v":8.8976377952755907},510,{"$f":"V21/25.4","v":20.078740157480315},"M8",null,null,null,null,null,null,null,null,null,null,"ROTATIONAL CLAMPS ON ALL SIDES INSTALLED WITHOUT LEDS TRIANGULAR ALIGNMENT PEGS AND PINS AT TOP TO ALIGN WITH BOTTOM OF NEXT PANEL"]
["ABSEN","ACCLAIM 1.5",343,610,61,8.5,13.503937007874017,24.015748031496063,2.4015748031496065,18.700000000000003,1.58,0.56229508196721312,0.20923,4.7794293361372651,"X",null,"TIL1XXAA, TIL1XXAP","TILVABAA",null,226,{"$f":"T22/25.4","v":8.8976377952755907},510,{"$f":"V22/25.4","v":20.078740157480315},"M8"]
["ABSEN","ACCLAIM 1.9",343,610,61,8.5,13.503937007874017,24.015748031496063,2.4015748031496065,18.700000000000003,1.91,0.56229508196721312,0.20923,4.7794293361372651,"X",null,"TIL1XXAA, TIL1XXAP","TILVABAA",null,226,8.8976377952755907,510,20.078740157480315,"M8"]
["ABSEN","ACCLAIM 2.5",343,610,61,8,13.503937007874017,24.015748031496063,2.4015748031496065,17.600000000000001,2.54,0.56229508196721312,0.20923,4.7794293361372651,"X",null,"TIL1XXAA, TIL1XXAP","TILVABAA",null,226,8.8976377952755907,510,20.078740157480315,"M8"]
["ABSEN","ACCLAIM 3.8",343,610,61,8,13.503937007874017,24.015748031496063,2.4015748031496065,17.600000000000001,3.81,0.56229508196721312,0.20923,4.7794293361372651,"X",null,"TIL1XXAA, TIL1XXAP","TILVABAA",null,226,8.8976377952755907,510,20.078740157480315,"M8"]
["ABSEN","ACCLAIM PRO 1.2",343,610,49,6,13.503937007874017,24.015748031496063,1.9291338582677167,13.200000000000001,1.27,0.56229508196721312,0.20923,4.7794293361372651,"X",null,"TIL1XXAP","TILVAB1",null,226,8.8976377952755907,510,20.078740157480315,"M8"]
["ABSEN","ACCLAIM PRO 1.5",343,610,49,6,13.503937007874017,24.015748031496063,1.9291338582677167,13.200000000000001,1.58,0.56229508196721312,0.20923,4.7794293361372651,"X",null,"TIL1XXAP","TILVAB1",null,226,8.8976377952755907,510,20.078740157480315,"M8"]
["ABSEN","ACCLAIM PLUS 1.2",343,610,49,6,13.503937007874017,24.015748031496063,1.9291338582677167,13.200000000000001,1.27,0.56229508196721312,0.20923,4.7794293361372651,"X",null,"TIL1XXAP","TILVAB1",null,226,8.8976377952755907,510,20.078740157480315,"M8"]
["ABSEN","ACCLAIM PLUS1.5",343,610,49,6,13.503937007874017,24.015748031496063,1.9291338582677167,13.200000000000001,1.58,0.56229508196721312,0.20923,4.7794293361372651,"X",null,"TIL1XXAP","TILVAB1",null,226,8.8976377952755907,510,20.078740157480315,"M8"]
["ABSEN","CR1.2",343,610,67,6,13.503937007874017,24.015748031496063,2.6377952755905514,13.200000000000001,1.25,0.56229508196721312,0.20923,4.7794293361372651]
["ABSEN","CR1.5",343,610,67,6,13.503937007874017,24.015748031496063,2.6377952755905514,13.200000000000001,1.58,0.56229508196721312,0.20923,4.7794293361372651]
["ABSEN","CR1.9",343,610,67,6,13.503937007874017,24.015748031496063,2.6377952755905514,13.200000000000001,1.9059999999999999,0.56229508196721312,0.20923,4.7794293361372651]
[]
["AOTO","CLD27ES0.7",337.5,600,null,null,{"$f":"C34/25.4","v":13.28740157480315},23.622047244094489,0,{"$f":"F34*2.2","v":0},0.78,0.5625,{"$f":"C34*D34/1000000","v":0.20250000000000001},4.9382716049382713]
["AOTO","CLD27ES0.9",337.5,600,null,null,13.28740157480315,23.622047244094489,0,{"$f":"F35*2.2","v":0},0.93,0.5625,{"$f":"C35*D35/1000000","v":0.20250000000000001},4.9382716049382713]
["AOTO","CLD27ES1.2",337.5,600,null,null,13.28740157480315,23.622047244094489,0,{"$f":"F36*2.2","v":0},1.25,0.5625,{"$f":"C36*D36/1000000","v":0.20250000000000001},4.9382716049382713]
["AOTO","CLD27ES1.5",337.5,600,null,null,13.28740157480315,23.622047244094489,0,{"$f":"F37*2.2","v":0},1.56,0.5625,{"$f":"C37*D37/1000000","v":0.20250000000000001},4.9382716049382713]
[]
["BAKO","BFP0.9SI",600,337.5,null,6,{"$f":"C39/25.4","v":23.622047244094489},13.28740157480315,0,{"$f":"F39*2.2","v":13.200000000000001},0.93700000000000006,1.7777777777777777,{"$f":"C39*D39/1000000","v":0.20250000000000001},4.9382716049382713]
["BAKO","BFP1.2SI",600,337.5,null,6,23.622047244094489,13.28740157480315,0,{"$f":"F40*2.2","v":13.200000000000001},1.25,1.7777777777777777,{"$f":"C40*D40/1000000","v":0.20250000000000001},4.9382716049382713]
["BAKO","BFP1.5SI",600,337.5,null,6,23.622047244094489,13.28740157480315,0,{"$f":"F41*2.2","v":13.200000000000001},1.56,1.7777777777777777,{"$f":"C41*D41/1000000","v":0.20250000000000001},4.9382716049382713]
["BAKO","BFP1.8SI",600,337.5,null,6,23.622047244094489,13.28740157480315,0,{"$f":"F42*2.2","v":13.200000000000001},1.87,1.7777777777777777,{"$f":"C42*D42/1000000","v":0.20250000000000001},4.9382716049382713]
["BAKO","BFP2.3SI",600,337.5,null,6,23.622047244094489,13.28740157480315,0,{"$f":"F43*2.2","v":13.200000000000001},2.34,1.7777777777777777,{"$f":"C43*D43/1000000","v":0.20250000000000001},4.9382716049382713]
[]
["BARCO","UNI-SEE LCD",null,null,null,null,null,null,null,null,null,null,{"$f":"C45*D45/1000000","v":0},{"$error":"#DIV/0!"}]
["BARCO","XT0.9",343.08,609.91999999999996,71,7.5,{"$f":"C46/25.4","v":13.507086614173229},24.012598425196849,2.7952755905511815,{"$f":"F46*2.2","v":16.5},0.95,{"$f":"C46/D46","v":0.5625},{"$f":"C46*D46/1000000","v":0.20925135359999997},4.7789416068083215,"X",null,null,null,"UNILUMINS UPANELS",null,null,null,null,null,null,null,null,null,null,"640 X 360"]
["BARCO","XT1.2",343.08,609.91999999999996,71,7.5,13.507086614173229,24.012598425196849,2.7952755905511815,{"$f":"F47*2.2","v":16.5},1.27,{"$f":"C47/D47","v":0.5625},{"$f":"C47*D47/1000000","v":0.20925135359999997},4.7789416068083215,"X",null,null,null,"UNILUMINS UPANELS",null,null,null,null,null,null,null,null,null,null,"480 X 270"]
["BARCO","XT1.5",343.08,609.91999999999996,71,7.5,13.507086614173229,24.012598425196849,2.7952755905511815,{"$f":"F48*2.2","v":16.5},1.58,{"$f":"C48/D48","v":0.5625},{"$f":"C48*D48/1000000","v":0.20925135359999997},4.7789416068083215,"X",null,null,null,"UNILUMINS UPANELS",null,null,null,null,null,null,null,null,null,null,"384 X 216"]
["BARCO","XT1.9",343.08,609.91999999999996,71,7.5,13.507086614173229,24.012598425196849,2.7952755905511815,{"$f":"F49*2.2","v":16.5},1.91,{"$f":"C49/D49","v":0.5625},{"$f":"C49*D49/1000000","v":0.20925135359999997},4.7789416068083215,"X",null,null,null,"UNILUMINS UPANELS",null,null,null,null,null,null,null,null,null,null,"320 X 180"]
[]
["CHAINZONE/IMPOSA","LPR-.9",343.12,610,38.5,7,{"$f":"C51/25.4","v":13.508661417322836},24.015748031496063,1.5157480314960632,{"$f":"F51*2.2","v":15.400000000000002},0.95299999999999996,{"$f":"C51/D51","v":0.56249180327868853},{"$f":"C51*D51/1000000","v":0.20930320000000002},4.7777578173673403,"X"]
["CHAINZONE/IMPOSA","LPR-1.2",343.12,610,38.5,7,13.508661417322836,24.015748031496063,1.5157480314960632,15.400000000000002,1.27,0.56249180327868853,0.20930320000000002,4.7777578173673403,"X"]
["CHAINZONE/IMPOSA","LPR-1.5",343.12,610,38.5,7,13.508661417322836,24.015748031496063,1.5157480314960632,15.400000000000002,1.5880000000000001,0.56249180327868853,0.20930320000000002,4.7777578173673403,"X"]
["CHAINZONE/IMPOSA","LPR-1.9",343.12,610,38.5,7,13.508661417322836,24.015748031496063,1.5157480314960632,15.400000000000002,1.9059999999999999,0.56249180327868853,0.20930320000000002,4.7777578173673403,"X"]
["CHAINZONE/IMPOSA","LPR-2.5",343.12,610,38.5,7,13.508661417322836,24.015748031496063,1.5157480314960632,15.400000000000002,2.54,0.56249180327868853,0.20930320000000002,4.7777578173673403,"X"]
["CHAINZONE/IMPOSA","LXL-1.9",250,1000,39,7.5,9.8425196850393704,39.370078740157481,1.5354330708661419,16.5,1.9,0.25,0.25,4,"X"]
["CHAINZONE/IMPOSA","LXL-2.6",250,1000,39,7.5,9.8425196850393704,39.370078740157481,1.5354330708661419,16.5,2.6,0.25,0.25,4,"X"]
["CHAINZONE/IMPOSA","LXL-3.9",250,1000,39,7.5,9.8425196850393704,39.370078740157481,1.5354330708661419,16.5,3.9,0.25,0.25,4,"X"]
["CHAINZONE/IMPOSA","LXR-1.9",1000,500,90,14,39.370078740157481,19.685039370078741,3.5433070866141736,30.800000000000004,1.9,2,0.5,2,"X"]
["CHAINZONE/IMPOSA","LXR-2.6",1000,500,90,14,39.370078740157481,19.685039370078741,3.5433070866141736,30.800000000000004,2.6,2,0.5,2,"X"]
["CHAINZONE/IMPOSA","LXR-3.9",1000,500,90,14,39.370078740157481,19.685039370078741,3.5433070866141736,30.800000000000004,3.9,2,0.5,2,"X"]
[]
["CHRISTIE","LED015-M",480,480,82.84,11.5,{"$f":"C63/25.4","v":18.897637795275593},{"$f":"D63/25.4","v":18.897637795275593},{"$f":"E63/25.4","v":3.2614173228346459},{"$f":"F63*2.2","v":25.3},1.5,1,{"$f":"C63*D63/1000000","v":0.23039999999999999},4.3402777777777777,"X"]
["CHRISTIE","LED019-M",480,480,86.89,11.5,18.897637795275593,18.897637795275593,3.4208661417322839,25.3,1.9,1,0.23039999999999999,4.3402777777777777,"X"]
["CHRISTIE","LED025-M",480,480,88.54,11.5,18.897637795275593,18.897637795275593,3.4858267716535436,25.3,2.5,1,0.23039999999999999,4.3402777777777777,"X"]
["CHRISTIE","LED030-M",480,480,86.04,11.5,18.897637795275593,18.897637795275593,3.3874015748031501,25.3,3,1,0.23039999999999999,4.3402777777777777,"X"]
["CHRISTIE","LED040-M",480,480,86.04,11.5,18.897637795275593,18.897637795275593,3.3874015748031501,25.3,4,1,0.23039999999999999,4.3402777777777777,"X"]
["CHRISTIE","LED 012-AL",345.6,614.4,94.3,9,13.606299212598428,24.188976377952756,3.7125984251968505,19.8,1.28,0.56250000000000011,0.21233664000000002,{"$f":"1/M68","v":4.7095027970679011},"X"]
["CHRISTIE","LED012-AP",614.4,345.6,94.3,9,24.188976377952756,13.606299212598428,3.7125984251968505,19.8,1.28,1.7777777777777777,0.21233664000000002,4.7095027970679011,"X"]
["CHRISTIE","LED016-AL",345.6,614.4,94.3,9,13.606299212598428,24.188976377952756,3.7125984251968505,19.8,1.6,0.56250000000000011,0.21233664000000002,4.7095027970679011,"X"]
["CHRISTIE","LED016-AP",614.4,345.6,94.3,9,24.188976377952756,13.606299212598428,3.7125984251968505,19.8,1.6,1.7777777777777777,0.21233664000000002,4.7095027970679011,"X"]
["CHRISTIE","LED019-AL",345.6,614.4,94.3,9,13.606299212598428,24.188976377952756,3.7125984251968505,19.8,1.92,0.56250000000000011,0.21233664000000002,4.7095027970679011,"X"]
["CHRISTIE","LED019-AP",614.4,345.6,94.3,9,24.188976377952756,13.606299212598428,3.7125984251968505,19.8,1.92,1.7777777777777777,0.21233664000000002,4.7095027970679011,"X"]
["CHRISTIE","LED025-AL",345.6,614.4,94.3,9,13.606299212598428,24.188976377952756,3.7125984251968505,19.8,2.56,0.56250000000000011,0.21233664000000002,4.7095027970679011,"X"]
["CHRISTIE","LED025-AP",614.4,345.6,94.3,9,24.188976377952756,13.606299212598428,3.7125984251968505,19.8,2.56,1.7777777777777777,0.21233664000000002,4.7095027970679011,"X"]
["CHRISTIE","LED012-CI",337.5,600,97,9.1199999999999992,13.28740157480315,23.622047244094489,3.8188976377952759,20.064,1.25,0.5625,0.20250000000000001,4.9382716049382713,"X"]
["CHRISTIE","LED015-CI",337.5,600,97,9.1199999999999992,13.28740157480315,23.622047244094489,3.8188976377952759,20.064,1.5625,0.5625,0.20250000000000001,4.9382716049382713,"X"]
["CHRISTIE","LED018-CI",337.5,600,97,9.1199999999999992,13.28740157480315,23.622047244094489,3.8188976377952759,20.064,1.875,0.5625,0.20250000000000001,4.9382716049382713,"X"]
["CHRISTIE","LED025-CI",337.5,600,97,9.1199999999999992,13.28740157480315,23.622047244094489,3.8188976377952759,20.064,2.5,0.5625,0.20250000000000001,4.9382716049382713,"X"]
[]
["CLT","H121S",600,337.5,85,10,{"$f":"C81/25.4","v":23.622047244094489},13.28740157480315,3.3464566929133861,{"$f":"F81*2.2","v":22},1.25,1.7777777777777777,{"$f":"C81*D81/1000000","v":0.20250000000000001},4.9382716049382713,"X"]
["CLT","H151S",600,337.5,85,9.8000000000000007,23.622047244094489,13.28740157480315,3.3464566929133861,{"$f":"F82*2.2","v":21.560000000000002},1.56,1.7777777777777777,{"$f":"C82*D82/1000000","v":0.20250000000000001},4.9382716049382713,"X"]
["CLT","H121Q",600,337.5,42,7,23.622047244094489,13.28740157480315,1.6535433070866143,{"$f":"F83*2.2","v":15.400000000000002},1.25,1.7777777777777777,{"$f":"C83*D83/1000000","v":0.20250000000000001},4.9382716049382713,"X"]
["CLT","H151Q",600,337.5,42,7,23.622047244094489,13.28740157480315,1.6535433070866143,{"$f":"F84*2.2","v":15.400000000000002},1.56,1.7777777777777777,{"$f":"C84*D84/1000000","v":0.20250000000000001},4.9382716049382713,"X"]
[]
["COLEDER","ACE BLOCK A0.9",600,337.5,88,8.5500000000000007,{"$f":"C86/25.4","v":23.622047244094489},13.28740157480315,3.4645669291338583,{"$f":"F86*2.2","v":18.810000000000002},0.9,{"$f":"C86/D86","v":1.7777777777777777},{"$f":"C86*D86/1000000","v":0.20250000000000001},4.9382716049382713,"X"]
["COLEDER","ACE BLOCK A1.2",600,337.5,88,8.5500000000000007,23.622047244094489,13.28740157480315,3.4645669291338583,{"$f":"F87*2.2","v":18.810000000000002},1.25,{"$f":"C87/D87","v":1.7777777777777777},{"$f":"C87*D87/1000000","v":0.20250000000000001},4.9382716049382713,"X"]
["COLEDER","ACE BLOCK A1.5",600,337.5,88,8.5,23.622047244094489,13.28740157480315,3.4645669291338583,{"$f":"F88*2.2","v":18.700000000000003},1.56,{"$f":"C88/D88","v":1.7777777777777777},{"$f":"C88*D88/1000000","v":0.20250000000000001},4.9382716049382713,"X"]
["COLEDER","ACE BLOCK A1.8",600,337.5,88,8.35,23.622047244094489,13.28740157480315,3.4645669291338583,{"$f":"F89*2.2","v":18.37},1.87,{"$f":"C89/D89","v":1.7777777777777777},{"$f":"C89*D89/1000000","v":0.20250000000000001},4.9382716049382713,"X"]
["COLEDER","ACE BLOCK A2.5",600,337.5,88,8.25,23.622047244094489,13.28740157480315,3.4645669291338583,{"$f":"F90*2.2","v":18.150000000000002},2.5,{"$f":"C90/D90","v":1.7777777777777777},{"$f":"C90*D90/1000000","v":0.20250000000000001},4.9382716049382713,"X"]
[]
["DELTA","FE-12",342,608,62,8,{"$f":"C92/25.4","v":13.464566929133859},23.937007874015748,2.4409448818897639,{"$f":"F92*2.2","v":17.600000000000001},1.27,{"$f":"C92/D92","v":0.5625},{"$f":"C92*D92/1000000","v":0.20793600000000001},4.809172052939366,"X"]
["DELTA","FE-15",342,608,62,8,13.464566929133859,23.937007874015748,2.4409448818897639,{"$f":"F93*2.2","v":17.600000000000001},1.58,0.5625,{"$f":"C93*D93/1000000","v":0.20793600000000001},4.809172052939366,"X",null,null,null,null,null,null,null,null,null,null,null,null,null,null,"384 X 216"]
["DELTA","FE-19",342,608,62,8,13.464566929133859,23.937007874015748,2.4409448818897639,{"$f":"F94*2.2","v":17.600000000000001},1.9,0.5625,{"$f":"C94*D94/1000000","v":0.20793600000000001},4.809172052939366,"X",null,null,null,null,null,null,null,null,null,null,null,null,null,null,"320 X 180"]
["DELTA","FE-25",342,608,62,8,13.464566929133859,23.937007874015748,2.4409448818897639,{"$f":"F95*2.2","v":17.600000000000001},2.5299999999999998,0.5625,{"$f":"C95*D95/1000000","v":0.20793600000000001},4.809172052939366,"X",null,null,null,null,null,null,null,null,null,null,null,null,null,null,"240 X 136"]
[]
["DIGITAL PROJECTION","RADIANCE LED 1.5",342,608,62,8.0500000000000007,{"$f":"C97/25.4","v":13.464566929133859},23.937007874015748,2.4409448818897639,{"$f":"F97*2.2","v":17.710000000000004},1.58,0.5625,{"$f":"C97*D97/1000000","v":0.20793600000000001},4.809172052939366,"X"]
["DIGITAL PROJECTION","RADIANCE LED 1.9",342,608,62,8.0500000000000007,13.464566929133859,23.937007874015748,2.4409448818897639,{"$f":"F98*2.2","v":17.710000000000004},1.9,0.5625,{"$f":"C98*D98/1000000","v":0.20793600000000001},4.809172052939366,"X"]
["DIGITAL PROJECTION","RADIANCE LED 2.5",342,608,62,8.0500000000000007,13.464566929133859,23.937007874015748,2.4409448818897639,{"$f":"F99*2.2","v":17.710000000000004},2.5299999999999998,0.5625,{"$f":"C99*D99/1000000","v":0.20793600000000001},4.809172052939366,"X"]
[]
["DISPLAY LAMP","HN1.2X",600,337.5,60,5.85,{"$f":"C101/25.4","v":23.622047244094489},13.28740157480315,2.3622047244094491,{"$f":"F101*2.2","v":12.870000000000001},1.25,1.7777777777777777,{"$f":"C101*D101/1000000","v":0.20250000000000001},4.9382716049382713,"X",null,null,null,"PART OF THE UNILUMIN GROUP"]
["DISPLAY LAMP","HN1.5X",600,337.5,60,5.85,23.622047244094489,13.28740157480315,2.3622047244094491,{"$f":"F102*2.2","v":12.870000000000001},1.56,1.7777777777777777,{"$f":"C102*D102/1000000","v":0.20250000000000001},4.9382716049382713,"X"]
["DISPLAY LAMP","HN1.8X",600,337.5,60,5.85,23.622047244094489,13.28740157480315,2.3622047244094491,{"$f":"F103*2.2","v":12.870000000000001},1.87,1.7777777777777777,{"$f":"C103*D103/1000000","v":0.20250000000000001},4.9382716049382713,"X"]
["DISPLAY LAMP","HN2.5X",600,337.5,60,5.85,23.622047244094489,13.28740157480315,2.3622047244094491,{"$f":"F104*2.2","v":12.870000000000001},2.5,1.7777777777777777,{"$f":"C104*D104/1000000","v":0.20250000000000001},4.9382716049382713,"X"]
[]
["DGX","DL 1.5",384,288,70,3,{"$f":"C106/25.4","v":15.118110236220474},11.338582677165356,2.7559055118110236,{"$f":"F106*2.2","v":6.6000000000000005},1.5,{"$f":"C106/D106","v":1.3333333333333333},{"$f":"C106*D106/1000000","v":0.110592},9.0422453703703702,"X"]
["DGX","DL1.6",384,288,70,3,15.118110236220474,11.338582677165356,2.7559055118110236,6.6000000000000005,1.6,1.3333333333333333,0.110592,9.0422453703703702,"X"]
["DGX","DL1.8",384,288,70,3,15.118110236220474,11.338582677165356,2.7559055118110236,6.6000000000000005,1.8460000000000001,1.3333333333333333,0.110592,9.0422453703703702,"X"]
["DGX","DU1.2",609.6,342.9,37.5,7.7,24.000000000000004,13.5,1.4763779527559056,16.940000000000001,1.27,1.7777777777777779,0.20903184,4.7839601852043208,"X"]
["DGX","DU1.5",609.6,342.9,37.5,7.7,24.000000000000004,13.5,1.4763779527559056,16.940000000000001,1.5874999999999999,1.7777777777777779,0.20903184,4.7839601852043208,"X"]
["DGX","DU1.9",609.6,342.9,37.5,7.7,24.000000000000004,13.5,1.4763779527559056,16.940000000000001,1.905,1.7777777777777779,0.20903184,4.7839601852043208,"X"]
[]
["ESDLUMEN","EHP 1.2",342,608,45,6.5,{"$f":"C113/25.4","v":13.464566929133859},23.937007874015748,1.7716535433070868,{"$f":"F113*2.2","v":14.3},1.26,0.5625,{"$f":"C113*D113/1000000","v":0.20793600000000001},4.809172052939366,"X"]
["ESDLUMEN","EHP1.5",342,608,45,6.5,13.464566929133859,23.937007874015748,1.7716535433070868,{"$f":"F114*2.2","v":14.3},1.5,0.5625,{"$f":"C114*D114/1000000","v":0.20793600000000001},4.809172052939366,"X"]
["ESDLUMEN","EHP1.9",342,608,45,6.5,13.464566929133859,23.937007874015748,1.7716535433070868,{"$f":"F115*2.2","v":14.3},1.9,0.5625,{"$f":"C115*D115/1000000","v":0.20793600000000001},4.809172052939366,"X"]
["ESDLUMEN","EHP2.6",342,608,45,6.5,13.464566929133859,23.937007874015748,1.7716535433070868,{"$f":"F116*2.2","v":14.3},2.6,0.5625,{"$f":"C116*D116/1000000","v":0.20793600000000001},4.809172052939366,"X"]
[]
["GLIC","P1.25",338,600,75,6.82,{"$f":"C118/25.4","v":13.30708661417323},23.622047244094489,2.9527559055118111,{"$f":"F118*2.2","v":15.004000000000001},1.25,{"$f":"C118/D118","v":0.56333333333333335},{"$f":"C118*D118/1000000","v":0.20280000000000001},4.9309664694280073]
["GLIC","P1.56",338,600,75,6.82,13.30708661417323,23.622047244094489,2.9527559055118111,15.004000000000001,1.56,0.56333333333333335,0.20280000000000001,4.9309664694280073]
["GLIC","P2.6",500,500,80,8.1999999999999993,19.685039370078741,19.685039370078741,3.1496062992125986,18.04,2.6,1,0.25,4]
["GLIC","P3.1",500,500,80,8.1999999999999993,19.685039370078741,19.685039370078741,3.1496062992125986,18.04,3.1,1,0.25,4]
["GLIC","P3.75",480,480,80,8.1999999999999993,18.897637795275593,18.897637795275593,3.1496062992125986,18.04,3.75,1,0.23039999999999999,4.3402777777777777]
["GLIC","P3.9",500,500,80,8.1999999999999993,19.685039370078741,19.685039370078741,3.1496062992125986,18.04,3.9,1,0.25,4]
["GLIC","P4",480,480,80,8.1999999999999993,18.897637795275593,18.897637795275593,3.1496062992125986,18.04,4,1,0.23039999999999999,4.3402777777777777]
["GLIC","P6",576,576,90,13.64,22.677165354330711,22.677165354330711,3.5433070866141736,30.008000000000003,6,1,0.33177600000000002,3.0140817901234565]
[]
["INFI LED","IL-FISS-IRHD1.25",450,400,99,9.6,{"$f":"C127/25.4","v":17.716535433070867},15.748031496062993,3.8976377952755907,{"$f":"F127*2.2","v":21.12},1.25,{"$f":"C127/D127","v":1.125},{"$f":"C127*D127/1000000","v":0.18},5.5555555555555554]
["INFI LED","IL-FISS-IRHD1.56",450,400,99,9.6,17.716535433070867,15.748031496062993,3.8976377952755907,{"$f":"F128*2.2","v":21.12},1.56,{"$f":"C128/D128","v":1.125},{"$f":"C128*D128/1000000","v":0.18},5.5555555555555554]
[]
["LEYARD/PLANAR","CLA1.5D",250,250,58,2.5,{"$f":"C130/25.4","v":9.8425196850393704},9.8425196850393704,2.2834645669291338,{"$f":"F130*2.2","v":5.5},1.5,1,{"$f":"C130*D130/1000000","v":6.25E-2},16]
["LEYARD/PLANAR","DL2-1.5",337.5,600,95,6.6,13.28740157480315,23.622047244094489,3.7401574803149606,14.52,1.5,0.5625,0.20250000000000001,4.9382716049382713]
["LEYARD/PLANAR","DL2-1.8",337.5,600,95,6.6,13.28740157480315,23.622047244094489,3.7401574803149606,14.52,1.875,0.5625,0.20250000000000001,{"$f":"1/M132","v":4.9382716049382713}]
["LEYARD/PLANAR","FXI-1.5",500,500,80,9.5,19.685039370078741,19.685039370078741,3.1496062992125986,20.900000000000002,1.5620000000000001,1,0.25,4,"X"]
["LEYARD/PLANAR","FXI-1.9",500,500,80,9.5,19.685039370078741,19.685039370078741,3.1496062992125986,20.900000000000002,1.9530000000000001,1,0.25,4,"X"]
["LEYARD/PLANAR","FXI-2.6",500,500,80,9.5,19.685039370078741,19.685039370078741,3.1496062992125986,20.900000000000002,2.6040000000000001,1,0.25,4,"X"]
["LEYARD/PLANAR","TWA.9",675,1200,95.5,30,26.5748031496063,47.244094488188978,3.7598425196850398,66,0.9375,0.5625,0.81,1.2345679012345678,null,"X"]
["LEYARD/PLANAR","TWA1.25",675,1200,95.5,30,26.5748031496063,47.244094488188978,3.7598425196850398,66,1.25,0.5625,0.81,1.2345679012345678,null,"X"]
["LEYARD/PLANAR","TWA1.49",675,1200,95.5,30,26.5748031496063,47.244094488188978,3.7598425196850398,66,1.49,0.5625,0.81,1.2345679012345678,null,"X",null,null,null,null,null,null,null,null,null,null,null,null,null,"805 X 452",null,19643.71]
["LEYARD/PLANAR","TWA1.875",675,1200,95.5,30,26.5748031496063,47.244094488188978,3.7598425196850398,66,1.875,0.5625,0.81,1.2345679012345678,null,"X"]
["LEYARD/PLANAR","TVF1.5",340.2,604.79999999999995,72.5,5.2,13.393700787401576,23.811023622047244,2.8543307086614176,11.440000000000001,1.575,0.5625,0.20575295999999998,4.8601973940010392,"X",null,"TIL1XXPT","TILVABPT",null,300.2,{"$f":"T140/25.4","v":11.818897637795276},564.79999999999995,{"$f":"V140/25.4","v":22.236220472440944},"M5"]
["LEYARD/PLANAR","TVF1.8",340.2,604.79999999999995,72.5,5.2,13.393700787401576,23.811023622047244,2.8543307086614176,11.440000000000001,1.89,0.5625,0.20575295999999998,4.8601973940010392,"X",null,"TIL1XXPT","TILVABPT",null,300.2,11.818897637795276,564.79999999999995,22.236220472440944,"M5"]
["LEYARD/PLANAR","TVF2.5",340.2,604.79999999999995,72.5,5.2,13.393700787401576,23.811023622047244,2.8543307086614176,11.440000000000001,2.52,0.5625,0.20575295999999998,4.8601973940010392,"X",null,"TIL1XXPT","TILVABPT",null,300.2,11.818897637795276,564.79999999999995,22.236220472440944,"M5"]
["LEYARD/PLANAR","TWS0.9",337.5,600,95,4.7,13.28740157480315,23.622047244094489,3.7401574803149606,10.340000000000002,0.9375,0.5625,0.20250000000000001,4.9382716049382713,null,null,null,null,null,295.5,11.633858267716537,558,21.968503937007874,"M6"]
["LEYARD/PLANAR","TWS1.2",337.5,600,95,4.7,13.28740157480315,23.622047244094489,3.7401574803149606,10.340000000000002,1.25,0.5625,0.20250000000000001,4.9382716049382713,null,null,null,null,null,295.5,11.633858267716537,558,21.968503937007874,"M6"]
["LEYARD/PLANAR","TWS1.5",337.5,600,95,4.7,13.28740157480315,23.622047244094489,3.7401574803149606,10.340000000000002,1.5625,0.5625,0.20250000000000001,4.9382716049382713,null,null,null,null,null,295.5,11.633858267716537,558,21.968503937007874,"M6"]
["LEYARD/PLANAR","TWS1.8",337.5,600,95,4.7,13.28740157480315,23.622047244094489,3.7401574803149606,10.340000000000002,1.875,0.5625,0.20250000000000001,4.9382716049382713,null,null,null,null,null,295.5,11.633858267716537,558,21.968503937007874,"M6"]
[]
["LG","LAS012DB2-F",340.2,604.79999999999995,72.5,5.3559999999999999,13.393700787401576,23.811023622047244,2.8543307086614176,11.783200000000001,1.26,0.5625,{"$f":"C148*D148/1000000","v":0.20575295999999998},4.8601973940010392,"X",null,"TIL1XXPT","TILVABPT","LEYARD TVF SERIES",300.2,{"$f":"T148/25.4","v":11.818897637795276},564.79999999999995,{"$f":"V148/25.4","v":22.236220472440944},"M5",null,null,null,null,null,"480 X 270"]
["LG","LAS012DB4-F",340.2,604.79999999999995,72.5,5.3559999999999999,13.393700787401576,23.811023622047244,2.8543307086614176,11.783200000000001,1.26,0.5625,0.20575295999999998,4.8601973940010392,"X",null,"TIL1XXPT","TILVABPT","LEYARD TVF SERIES",300.2,{"$f":"T149/25.4","v":11.818897637795276},564.79999999999995,{"$f":"V149/25.4","v":22.236220472440944},"M5",null,null,null,null,null,"480 X 270"]
["LG","LAS012DB7-F",340.2,604.79999999999995,72.5,5.3559999999999999,13.393700787401576,23.811023622047244,2.8543307086614176,11.783200000000001,1.26,0.5625,0.20575295999999998,4.8601973940010392,"X",null,"TIL1XXPT","TILVABPT","LEYARD TVF SERIES",300.2,{"$f":"T150/25.4","v":11.818897637795276},564.79999999999995,{"$f":"V150/25.4","v":22.236220472440944},"M5",null,null,null,null,null,"480 X 270"]
["LG","LAS014DB2-F",340.2,604.79999999999995,72.5,5.3559999999999999,13.393700787401576,23.811023622047244,2.8543307086614176,11.783200000000001,1.454,0.5625,0.20575295999999998,4.8601973940010392,"X",null,"TIL1XXPT","TILVABPT","LEYARD TVF SERIES",300.2,{"$f":"T151/25.4","v":11.818897637795276},564.79999999999995,{"$f":"V151/25.4","v":22.236220472440944},"M5",null,null,null,null,null,"416 X 234"]
["LG","LAS014DB4-F",340.2,604.79999999999995,72.5,5.3559999999999999,13.393700787401576,23.811023622047244,2.8543307086614176,11.783200000000001,1.454,0.5625,0.20575295999999998,4.8601973940010392,"X",null,"TIL1XXPT","TILVABPT","LEYARD TVF SERIES",300.2,11.818897637795276,564.79999999999995,22.236220472440944,"M5",null,null,null,null,null,"416 X 234"]
["LG","LAS014DB7-F",340.2,604.79999999999995,72.5,5.3559999999999999,13.393700787401576,23.811023622047244,2.8543307086614176,11.783200000000001,1.454,0.5625,0.20575295999999998,4.8601973940010392,"X",null,"TIL1XXPT","TILVABPT","LEYARD TVF SERIES",300.2,11.818897637795276,564.79999999999995,22.236220472440944,"M5",null,null,null,null,null,"416 X 234"]
["LG","LAS015DB2-F",340.2,604.79999999999995,72.5,5.3559999999999999,13.393700787401576,23.811023622047244,2.8543307086614176,11.783200000000001,1.575,0.5625,0.20575295999999998,4.8601973940010392,"X",null,"TIL1XXPT","TILVABPT","LEYARD TVF SERIES",300.2,11.818897637795276,564.79999999999995,22.236220472440944,"M5",null,null,null,null,null,"384 X 216"]
["LG","LAS015DB4-F",340.2,604.79999999999995,72.5,5.3559999999999999,13.393700787401576,23.811023622047244,2.8543307086614176,11.783200000000001,1.575,0.5625,0.20575295999999998,4.8601973940010392,"X",null,"TIL1XXPT","TILVABPT","LEYARD TVF SERIES",300.2,11.818897637795276,564.79999999999995,22.236220472440944,"M5",null,null,null,null,null,"384 X 216"]
["LG","LAS015DB7-F",340.2,604.79999999999995,72.5,5.3559999999999999,13.393700787401576,23.811023622047244,2.8543307086614176,11.783200000000001,1.575,0.5625,0.20575295999999998,4.8601973940010392,"X",null,"TIL1XXPT","TILVABPT","LEYARD TVF SERIES",300.2,11.818897637795276,564.79999999999995,22.236220472440944,"M5",null,null,null,null,null,"384 X 216"]
["LG","LAS018DB2-F",340.2,604.79999999999995,72.5,5.3559999999999999,13.393700787401576,23.811023622047244,2.8543307086614176,11.783200000000001,1.89,0.5625,0.20575295999999998,4.8601973940010392,"X",null,"TIL1XXPT","TILVABPT","LEYARD TVF SERIES",300.2,11.818897637795276,564.79999999999995,22.236220472440944,"M5",null,null,null,null,null,"320 X 180"]
["LG","LAS018DB4-F",340.2,604.79999999999995,72.5,5.3559999999999999,13.393700787401576,23.811023622047244,2.8543307086614176,11.783200000000001,1.89,0.5625,0.20575295999999998,4.8601973940010392,"X",null,"TIL1XXPT","TILVABPT","LEYARD TVF SERIES",300.2,11.818897637795276,564.79999999999995,22.236220472440944,"M5",null,null,null,null,null,"320 X 180"]
["LG","LAS018DB7-F",340.2,604.79999999999995,72.5,5.3559999999999999,13.393700787401576,23.811023622047244,2.8543307086614176,11.783200000000001,1.89,0.5625,0.20575295999999998,4.8601973940010392,"X",null,"TIL1XXPT","TILVABPT","LEYARD TVF SERIES",300.2,11.818897637795276,564.79999999999995,22.236220472440944,"M5",null,null,null,null,null,"320 X 180"]
["LG","LAS025DB2-F",340.2,604.79999999999995,72.5,5.3559999999999999,13.393700787401576,23.811023622047244,2.8543307086614176,11.783200000000001,2.5,0.5625,0.20575295999999998,4.8601973940010392,"X",null,"TIL1XXPT","TILVABPT","LEYARD TVF SERIES",300.2,11.818897637795276,564.79999999999995,22.236220472440944,"M5",null,null,null,null,null,"240 X 136"]
["LG","LAS025DB4-F",340.2,604.79999999999995,72.5,5.3559999999999999,13.393700787401576,23.811023622047244,2.8543307086614176,11.783200000000001,2.5,0.5625,0.20575295999999998,4.8601973940010392,"X",null,"TIL1XXPT","TILVABPT","LEYARD TVF SERIES",300.2,11.818897637795276,564.79999999999995,22.236220472440944,"M5",null,null,null,null,null,"240 X 136"]
["LG","LAS025DB7-F",340.2,604.79999999999995,72.5,5.3559999999999999,13.393700787401576,23.811023622047244,2.8543307086614176,11.783200000000001,2.5,0.5625,0.20575295999999998,4.8601973940010392,"X",null,"TIL1XXPT","TILVABPT","LEYARD TVF SERIES",300.2,11.818897637795276,564.79999999999995,22.236220472440944,"M5",null,null,null,null,null,"240 X 136"]
["LG","LAE029DD3E",1000,500,68,15.5,39.370078740157481,19.685039370078741,2.6771653543307088,34.1,2.97,2,0.5,2,"X",null,null,null,null,null,0,null,0]
["LG","LAE029DD4E",1000,500,68,15.5,39.370078740157481,19.685039370078741,2.6771653543307088,34.1,2.97,2,0.5,2,"X",null,null,null,null,null,0,null,0]
["LG","LAE039DD3",1000,500,68,12.5,39.370078740157481,19.685039370078741,2.6771653543307088,27.500000000000004,3.91,2,0.5,2,"X",null,null,null,null,null,0,null,0]
["LG","LAE039DD4",1000,500,68,12.5,39.370078740157481,19.685039370078741,2.6771653543307088,27.500000000000004,3.91,2,0.5,2,"X",null,null,null,null,null,0,null,0]
["LG","LAE029DD3DE",500,500,68,10,19.685039370078741,19.685039370078741,2.6771653543307088,22,2.97,1,0.25,4,"X",null,null,null,null,null,0,null,0]
["LG","LAE029DD4DE",500,500,68,10,19.685039370078741,19.685039370078741,2.6771653543307088,22,2.97,1,0.25,4,"X",null,null,null,null,null,0,null,0]
["LG","LAE039DD3D",500,500,68,8.1999999999999993,19.685039370078741,19.685039370078741,2.6771653543307088,18.04,3.91,1,0.25,4,"X",null,null,null,null,null,0,null,0]
["LG","LAE039DD4D",500,500,68,8.1999999999999993,19.685039370078741,19.685039370078741,2.6771653543307088,18.04,3.91,1,0.25,4,"X",null,null,null,null,null,0,null,0]
["LG","LAS025DB9-V",500,500,78.8,7,19.685039370078741,19.685039370078741,3.1023622047244097,15.400000000000002,2.5,1,0.25,4,"X",null,null,null,null,440,17.322834645669293,440,17.322834645669293]
["LG","LAS039DB9-V",500,500,78.8,7,19.685039370078741,19.685039370078741,3.1023622047244097,15.400000000000002,3.9,1,0.25,4,"X",null,null,null,null,440,17.322834645669293,440,17.322834645669293]
["LG","LAS025DB7-V",500,500,78.8,7,19.685039370078741,19.685039370078741,3.1023622047244097,15.400000000000002,2.5,1,0.25,4,"X",null,null,null,null,440,17.322834645669293,440,17.322834645669293]
["LG","LAS039DB7-V",500,500,78.8,7,19.685039370078741,19.685039370078741,3.1023622047244097,15.400000000000002,3.9,1,0.25,4,"X",null,null,null,null,440,17.322834645669293,440,17.322834645669293]
["LG","LSCA029-1000 mm",1000,500,66,14,39.370078740157481,19.685039370078741,2.598425196850394,30.800000000000004,2.97,2,0.5,2,"X",null,null,null,null,944,37.165354330708666,444,17.480314960629922]
["LG","LSCA039-1000 mm",1000,500,66,14,39.370078740157481,19.685039370078741,2.598425196850394,30.800000000000004,3.91,2,0.5,2,"X",null,null,null,null,944,37.165354330708666,444,17.480314960629922]
["LG","LSCA029-500 mm",500,500,66,10,19.685039370078741,19.685039370078741,2.598425196850394,22,2.97,1,0.25,4,"X",null,null,null,null,444,17.480314960629922,444,17.480314960629922]
["LG","LSCA039-500 mm",500,500,66,10,19.685039370078741,19.685039370078741,2.598425196850394,22,3.91,1,0.25,4,"X",null,null,null,null,444,17.480314960629922,444,17.480314960629922]
[]
["LIGHTHOUSE","q1.5",270,480,80.5,6.7210000000000001,{"$f":"C180/25.4","v":10.62992125984252},18.897637795275593,3.1692913385826773,{"$f":"F180*2.2","v":14.786200000000001},1.5,{"$f":"C180/D180","v":0.5625},{"$f":"C180*D180/1000000","v":0.12959999999999999},7.7160493827160499,"X"]
["LIGHTHOUSE","q1.8",270,480,80.5,6.7210000000000001,10.62992125984252,18.897637795275593,3.1692913385826773,{"$f":"F181*2.2","v":14.786200000000001},1.8,{"$f":"C181/D181","v":0.5625},{"$f":"C181*D181/1000000","v":0.12959999999999999},7.7160493827160499,"X"]
["LIGHTHOUSE","q2.5",270,480,80.5,6.7210000000000001,10.62992125984252,18.897637795275593,3.1692913385826773,{"$f":"F182*2.2","v":14.786200000000001},2.5,{"$f":"C182/D182","v":0.5625},{"$f":"C182*D182/1000000","v":0.12959999999999999},7.7160493827160499,"X"]
[]
["MITSUBISHI","VS-12NP160",540,480,99,13,{"$f":"C184/25.4","v":21.259842519685041},18.897637795275593,3.8976377952755907,{"$f":"F184*2.2","v":28.6},1.25,{"$f":"C184/D184","v":1.125},{"$f":"C184*D184/1000000","v":0.25919999999999999},3.8580246913580249]
["MITSUBISHI","VS-15NP160",540,480,90,12,21.259842519685041,18.897637795275593,3.5433070866141736,26.400000000000002,1.5,1.125,{"$f":"C185*D185/1000000","v":0.25919999999999999},3.8580246913580249,"X"]
[]
["NANOLUMENS","ENGAGE SERIES",337.5,600,101.6,5.0999999999999996,13.28740157480315,23.622047244094489,4,11.22,1.2,{"$f":"C187/D187","v":0.5625},{"$f":"C187*D187/1000000","v":0.20250000000000001},4.9382716049382713]
["NANOLUMENS","ENGAGE SERIES",337.5,600,101.6,5.0999999999999996,13.28740157480315,23.622047244094489,4,11.22,1.5,0.5625,0.20250000000000001,4.9382716049382713,"X"]
["NANOLUMENS","ENGAGE SERIES",337.5,600,101.6,5.0999999999999996,13.28740157480315,23.622047244094489,4,11.22,1.8,0.5625,0.20250000000000001,4.9382716049382713]
["NANOLUMENS","ENGAGE SERIES",337.5,600,101.6,5.0999999999999996,13.28740157480315,23.622047244094489,4,11.22,2.5,0.5625,0.20250000000000001,4.9382716049382713,"X"]
["NANOLUMENS","NIXEL SERIES",150,240,79.375,2.3199999999999998,5.9055118110236222,9.4488188976377963,3.125,5.1040000000000001,2.5,0.625,3.5999999999999997E-2,27.777777777777779,"X"]
["NANOLUMENS","NIXEL SERIES",152.4,304.8,79.375,2.86,{"$f":"C192/25.4","v":6.0000000000000009},12.000000000000002,3.125,6.2919999999999998,3,0.5,4.6451520000000003E-2,21.527820833419444,"X"]
["NANOLUMENS","NIXEL SERIES",152.4,304.8,79.375,2.86,6.0000000000000009,12.000000000000002,3.125,6.2919999999999998,4,0.5,4.6451520000000003E-2,21.527820833419444,"X"]
["NANOLUMENS","NIXEL SERIES",152.4,304.8,79.375,2.86,6.0000000000000009,12.000000000000002,3.125,{"$f":"F194*2.2","v":6.2919999999999998},5,0.5,4.6451520000000003E-2,21.527820833419444,"X"]
["NANOLUMENS","NIXEL SERIES",152.4,304.8,79.375,2.86,6.0000000000000009,12.000000000000002,3.125,{"$f":"F195*2.2","v":6.2919999999999998},6,0.5,4.6451520000000003E-2,21.527820833419444,"X"]
["NANOLUMENS","NIXEL SERIES",152.4,304.8,79.375,2.86,6.0000000000000009,12.000000000000002,3.125,{"$f":"F196*2.2","v":6.2919999999999998},9,0.5,4.6451520000000003E-2,{"$f":"1/M196","v":21.527820833419444},"X"]
[]
["NEC","LO12i",480,480,89,8,{"$f":"C198/25.4","v":18.897637795275593},{"$f":"D198/25.4","v":18.897637795275593},{"$f":"E198/25.4","v":3.5039370078740157},{"$f":"F198*2.2","v":17.600000000000001},1.29,1,{"$f":"C198*D198/1000000","v":0.23039999999999999},4.3402777777777777,"X",null,null,null,null,null,null,null,null,null,null,null,null,null,null,"372 X 372"]
["NEC","LO15i",480,480,89,8,18.897637795275593,18.897637795275593,3.5039370078740157,17.600000000000001,1.58,1,0.23039999999999999,4.3402777777777777,"X",null,null,null,null,null,null,null,null,null,null,null,null,null,null,"304 X 304"]
["NEC","LO20i",480,480,89,8,18.897637795275593,18.897637795275593,3.5039370078740157,17.600000000000001,2,1,0.23039999999999999,4.3402777777777777,"X",null,null,null,null,null,null,null,null,null,null,null,null,null,null,"240 X 240"]
["NEC","LO25i",480,480,89,8,18.897637795275593,18.897637795275593,3.5039370078740157,17.600000000000001,2.5,1,0.23039999999999999,4.3402777777777777,"X",null,null,null,null,null,null,null,null,null,null,null,null,null,null,"192 X 192"]
["NEC","LO30i",480,480,89,8,18.897637795275593,18.897637795275593,3.5039370078740157,17.600000000000001,3,1,0.23039999999999999,4.3402777777777777,"X",null,null,null,null,null,null,null,null,null,null,null,null,null,null,"160 X 160"]
["NEC","LO40i",480,480,89,8,18.897637795275593,18.897637795275593,3.5039370078740157,17.600000000000001,4,1,0.23039999999999999,4.3402777777777777,"X",null,null,null,null,null,null,null,null,null,null,null,null,null,null,"120 X 120"]
["NEC","LO48i",480,480,89,8,18.897637795275593,18.897637795275593,3.5039370078740157,17.600000000000001,4.8,{"$f":"C204/D204","v":1},0.23039999999999999,4.3402777777777777,"X",null,null,null,null,null,null,null,null,null,null,null,null,null,null,"100 X 100"]
["NEC","LO60i",480,480,89,8,18.897637795275593,18.897637795275593,3.5039370078740157,17.600000000000001,6,1,0.23039999999999999,4.3402777777777777,"X",null,null,null,null,null,null,null,null,null,null,null,null,null,null,"80 X 80"]
["NEC","LED-F012i",342,608,90,9.5,13.464566929133859,23.937007874015748,3.5433070866141736,20.900000000000002,1.26,0.5625,0.20793600000000001,4.809172052939366,"X",null,null,null,null,null,null,null,null,null,null,null,null,null,null,"480 X 720"]
["NEC","LED-F015i",342,608,90,9.5,13.464566929133859,23.937007874015748,3.5433070866141736,20.900000000000002,1.58,0.5625,0.20793600000000001,4.809172052939366,"X"]
["NEC","LED-F019i",342,608,90,9.5,13.464566929133859,23.937007874015748,3.5433070866141736,20.900000000000002,1.9,0.5625,0.20793600000000001,4.809172052939366,"X"]
["NEC","LED-F023i",342,608,90,9.5,13.464566929133859,23.937007874015748,3.5433070866141736,20.900000000000002,2.2999999999999998,0.5625,0.20793600000000001,4.809172052939366,"X"]
["NEC","LED-F027i",342,608,90,9.5,13.464566929133859,23.937007874015748,3.5433070866141736,20.900000000000002,2.7,0.5625,0.20793600000000001,4.809172052939366,"X"]
["NEC","LED-F038i",342,608,90,9.5,13.464566929133859,23.937007874015748,3.5433070866141736,20.900000000000002,3.8,0.5625,0.20793600000000001,4.809172052939366,"X"]
["NEC","LED-FE012i2",342,608,50,8.8000000000000007,13.464566929133859,23.937007874015748,1.9685039370078741,19.360000000000003,1.266,0.5625,0.20793600000000001,4.809172052939366,"X"]
["NEC","LED-FE015i2",342,608,50,8.8000000000000007,13.464566929133859,23.937007874015748,1.9685039370078741,19.360000000000003,1.583,0.5625,0.20793600000000001,4.809172052939366,"X"]
["NEC","LED-FE019i2",342,608,50,8.8000000000000007,13.464566929133859,23.937007874015748,1.9685039370078741,19.360000000000003,1.9,0.5625,0.20793600000000001,4.809172052939366,"X"]
["NEC","LED-FE025i2",342,608,50,8.8000000000000007,13.464566929133859,23.937007874015748,1.9685039370078741,19.360000000000003,2.5329999999999999,0.5625,0.20793600000000001,4.809172052939366,"X"]
["NEC","LED-FE031i2",342,608,50,8.8000000000000007,13.464566929133859,23.937007874015748,1.9685039370078741,19.360000000000003,3.1669999999999998,0.5625,0.20793600000000001,4.809172052939366,"X"]
["NEC","LED-FE038i2",342,608,50,8.8000000000000007,13.464566929133859,23.937007874015748,1.9685039370078741,19.360000000000003,3.8,0.5625,0.20793600000000001,4.809172052939366,"X"]
[]
["NEOTI","U09I",337.5,600,99.4,8.61,{"$f":"C219/25.4","v":13.28740157480315},23.622047244094489,3.9133858267716541,{"$f":"F219*2.2","v":18.942},0.93,0.5625,{"$f":"C219*D219/1000000","v":0.20250000000000001},4.9382716049382713,"X"]
["NEOTI","U12I",337.5,600,99.4,8.61,13.28740157480315,23.622047244094489,3.9133858267716541,18.942,1.25,0.5625,0.20250000000000001,4.9382716049382713,"X"]
["NEOTI","U15I",337.5,600,99.4,8.61,13.28740157480315,23.622047244094489,3.9133858267716541,18.942,1.56,0.5625,0.20250000000000001,4.9382716049382713,"X"]
["NEOTI","U18I",337.5,600,99.4,8.61,13.28740157480315,23.622047244094489,3.9133858267716541,18.942,1.87,0.5625,0.20250000000000001,4.9382716049382713,"X"]
["NEOTI","U25I",337.5,600,99.4,8.61,13.28740157480315,23.622047244094489,3.9133858267716541,18.942,2.5,0.5625,0.20250000000000001,4.9382716049382713,"X"]
["NEOTI","U31I",337.5,600,99.4,8.61,13.28740157480315,23.622047244094489,3.9133858267716541,18.942,3.1,0.5625,0.20250000000000001,4.9382716049382713,"X"]
["NEOTI","U46I",337.5,600,99.4,8.61,13.28740157480315,23.622047244094489,3.9133858267716541,18.942,4.5999999999999996,0.5625,0.20250000000000001,4.9382716049382713,"X"]
[]
["PHILLIPS","27BDL9119L",342,608,55,7.5,{"$f":"C227/25.4","v":13.464566929133859},23.937007874015748,2.1653543307086616,{"$f":"F227*2.2","v":16.5},1.9,0.5625,{"$f":"C227*D227/1000000","v":0.20793600000000001},4.809172052939366,"X",null,null,null,null,302,{"$f":"T227/25.4","v":11.889763779527559},568,{"$f":"V227/25.4","v":22.362204724409452},"M8 X 20"]
["PHILLIPS","27BDL9115L",342,608,55,7.5,13.464566929133859,23.937007874015748,2.1653543307086616,16.5,1.583,0.5625,0.20793600000000001,4.809172052939366,"X",null,null,null,null,302,{"$f":"T228/25.4","v":11.889763779527559},568,{"$f":"V228/25.4","v":22.362204724409452},"M8 X 20"]
["PHILLIPS","27BDL9112L",342,608,55,7.5,13.464566929133859,23.937007874015748,2.1653543307086616,16.5,1.266,0.5625,0.20793600000000001,4.809172052939366,"X",null,null,null,null,302,{"$f":"T229/25.4","v":11.889763779527559},568,{"$f":"V229/25.4","v":22.362204724409452},"M8 X 20"]
["PHILLIPS","44BDL8139L",500,1000,86,15.6,19.685039370078741,39.370078740157481,3.3858267716535435,34.32,2.84,0.5,0.5,2,"X"]
["PHILLIPS","44BDL8148L",500,1000,86,15.6,19.685039370078741,39.370078740157481,3.3858267716535435,34.32,3.91,0.5,0.5,2,"X"]
["PHILLIPS","44BDL89112L",500,1000,86,15.6,19.685039370078741,39.370078740157481,3.3858267716535435,34.32,4.8099999999999996,0.5,0.5,2,"X"]
[]
["PixelFlex","FXe-1.0",360,640,58,7.4,{"$f":"C234/25.4","v":14.173228346456694},{"$f":"D234/25.4","v":25.196850393700789},{"$f":"E234/25.4","v":2.2834645669291338},{"$f":"F234*2.2","v":16.28},1,0.5625,{"$f":"C234*D234/1000000","v":0.23039999999999999},4.3402777777777777,"X",null,null,null,null,null,null,null,null,null,"3 X 3","4 X 4",null,"6 X 6",null,"640 X 360"]
["PixelFlex","FXe-1.2",360,640,58,7.4,14.173228346456694,25.196850393700789,2.2834645669291338,16.28,1.2,0.5625,0.23039999999999999,4.3402777777777777,"X",null,null,null,null,null,null,null,null,null,null,"5 X 5",null,null,null,"512 X 288"]
["PixelFlex","FXe-1.4",360,640,58,7.4,14.173228346456694,25.196850393700789,2.2834645669291338,16.28,1.4,0.5625,0.23039999999999999,4.3402777777777777,"X",null,null,null,null,null,null,null,null,null,null,null,null,null,null,"440 X 248"]
["PixelFlex","FXe-1.6",360,640,58,7.4,14.173228346456694,25.196850393700789,2.2834645669291338,16.28,1.6,0.5625,0.23039999999999999,4.3402777777777777,"X",null,null,null,null,null,null,null,null,null,"5 X 5",null,null,null,null,"384 X 216"]
["PixelFlex","FXe-1.8",360,640,58,7.4,14.173228346456694,25.196850393700789,2.2834645669291338,16.28,1.8,0.5625,0.23039999999999999,4.3402777777777777,"X",null,null,null,null,null,null,null,null,null,null,null,null,null,null,"340 X 192"]
["PixelFlex","FXe-2.0",360,640,58,7.4,14.173228346456694,25.196850393700789,2.2834645669291338,16.28,2,0.5625,0.23039999999999999,4.3402777777777777,"X",null,null,null,null,null,null,null,null,null,"6 X 6","8 X 8",null,null,null,"320 X 180"]
["PixelFlex","FXe-2.5",360,640,58,7.4,14.173228346456694,25.196850393700789,2.2834645669291338,16.28,2.5,0.5625,0.23039999999999999,4.3402777777777777,"X",null,null,null,null,null,null,null,null,null,null,null,null,null,null,"256 X 144"]
["PixelFlex","FXe-2.9",360,640,58,7.4,14.173228346456694,25.196850393700789,2.2834645669291338,16.28,2.9,0.5625,0.23039999999999999,4.3402777777777777,"X",null,null,null,null,null,null,null,null,null,null,null,null,null,null,"220 X 124"]
["PixelFlex","FXe-4.0",360,640,58,7.4,14.173228346456694,25.196850393700789,2.2834645669291338,16.28,4,0.5625,0.23039999999999999,4.3402777777777777,"X",null,null,null,null,null,null,null,null,null,null,null,null,null,null,"160 X 90"]
["PixelFlex","Fxe-0.95v2",null,null,null,null,0,0,0,0,0.95,{"$error":"#DIV/0!"},0,{"$error":"#DIV/0!"},"X"]
["PixelFlex","Fxe-1.2v2",342,608,71,6.8,13.464566929133859,23.937007874015748,2.7952755905511815,14.96,1.2,0.5625,0.20793600000000001,4.809172052939366,"X",null,null,null,null,null,null,null,null,null,null,null,null,null,null,"480 X 270"]
["PixelFlex","Fxe-1.58v2",342,608,71,6.8,13.464566929133859,23.937007874015748,2.7952755905511815,14.96,1.6,0.5625,0.20793600000000001,4.809172052939366,"X",null,null,null,null,null,null,null,null,null,null,null,null,null,null,"384 X 216"]
["PixelFlex","Fxe-1.9v2",342,608,71,6.8,13.464566929133859,23.937007874015748,2.7952755905511815,14.96,1.9,0.5625,0.20793600000000001,4.809172052939366,"X",null,null,null,null,null,null,null,null,null,null,null,null,null,null,"320 X 180"]
["PixelFlex","Fxe-2.5v2",342,608,71,6.8,13.464566929133859,23.937007874015748,2.7952755905511815,14.96,205,0.5625,0.20793600000000001,4.809172052939366,"X",null,null,null,null,null,null,null,null,null,null,null,null,null,null,"240 X 135"]
[]
["PRIMEVIEW","FUSION SERIES                    PRVLEDFSN09M",343.125,610,38.5,7,{"$f":"C249/25.4","v":13.508858267716537},24.015748031496063,1.5157480314960632,{"$f":"F249*2.2","v":15.400000000000002},0.95299999999999996,{"$f":"C249/D249","v":0.5625},{"$f":"C249*D249/1000000","v":0.20930625},4.7776881961241005,"X",null,null,null,null,293.125,{"$f":"T249/25.4","v":11.540354330708663},550,{"$f":"V249/25.4","v":21.653543307086615},null,null,null,null,null,null,"640 X 360"]
["PRIMEVIEW","FUSION SERIES                    PRVLEDFSN12M",343.125,610,38.5,7,13.508858267716537,24.015748031496063,1.5157480314960632,15.400000000000002,1.27,0.5625,0.20930625,4.7776881961241005,"X",null,null,null,null,293.125,{"$f":"T250/25.4","v":11.540354330708663},550,{"$f":"V250/25.4","v":21.653543307086615},null,null,null,null,null,null,"480 X 270"]
["PRIMEVIEW","FUSION SERIES                    PRVLEDFSN09",343.125,610,38.5,7,13.508858267716537,24.015748031496063,1.5157480314960632,15.400000000000002,0.95299999999999996,0.5625,0.20930625,4.7776881961241005,"X",null,null,null,null,293.125,11.540354330708663,550,21.653543307086615,null,null,null,null,null,null,"640 X 360"]
["PRIMEVIEW","FUSION SERIES                    PRVLEDFSN12M",343.125,610,38.5,7,13.508858267716537,24.015748031496063,1.5157480314960632,15.400000000000002,1.25,0.5625,0.20930625,4.7776881961241005,"X",null,null,null,null,293.125,11.540354330708663,550,21.653543307086615,null,null,null,null,null,null,"480 X 270"]
["PRIMEVIEW","FUSION SERIES                    PRVLEDFSN15",343.125,610,38.5,7,13.508858267716537,24.015748031496063,1.5157480314960632,15.400000000000002,1.58,0.5625,0.20930625,4.7776881961241005,"X",null,null,null,null,293.125,11.540354330708663,550,21.653543307086615,null,null,null,null,null,null,"384 X 216"]
["PRIMEVIEW","FUSION SERIES                    PRVLEDFSN19",343.125,610,38.5,7,13.508858267716537,24.015748031496063,1.5157480314960632,15.400000000000002,1.9,0.5625,0.20930625,4.7776881961241005,"X",null,null,null,null,293.125,11.540354330708663,550,21.653543307086615,null,null,null,null,null,null,"320 X 180"]
["PRIMEVIEW","FUSION SERIES                    PRVLEDFSN25",343.125,610,38.5,7,13.508858267716537,24.015748031496063,1.5157480314960632,15.400000000000002,2.54,0.5625,0.20930625,4.7776881961241005,"X",null,null,null,null,293.125,11.540354330708663,550,21.653543307086615,null,null,null,null,null,null,"240 X 135"]
["PRIMEVIEW",null,null,null,null,null,null,null,null,null,null,null,0,{"$error":"#DIV/0!"}]
["PRIMEVIEW",null,null,null,null,null,null,null,null,null,null,null,0,{"$error":"#DIV/0!"}]
["PRIMEVIEW",null,null,null,null,null,null,null,null,null,null,null,0,{"$error":"#DIV/0!"}]
[]
["RMG",null,null,null,null,null,null,null,null,null,null,null,{"$f":"C260*D260/1000000","v":0},{"$f":"1/M260","v":{"$error":"#DIV/0!"}}]
[]
["ROE","AMBER 0.9",337.5,600,55,8.5,{"$f":"C262/25.4","v":13.28740157480315},23.622047244094489,2.1653543307086616,{"$f":"F262*2.2","v":18.700000000000003},0.9375,{"$f":"C262/D262","v":0.5625},{"$f":"C262*D262/1000000","v":0.20250000000000001},4.9382716049382713]
["ROE","AMBER 1.2",337.5,600,55,8.5,13.28740157480315,23.622047244094489,2.1653543307086616,18.700000000000003,1.25,0.5625,0.20250000000000001,4.9382716049382713]
["ROE","AMBER 1.5",337.5,600,55,8.5,13.28740157480315,23.622047244094489,2.1653543307086616,18.700000000000003,1.5625,0.5625,0.20250000000000001,4.9382716049382713]
["ROE","AMBER 1.8",337.5,600,55,8.5,13.28740157480315,23.622047244094489,2.1653543307086616,18.700000000000003,1.875,0.5625,0.20250000000000001,4.9382716049382713]
["ROE","JASPER 2.6",500,500,60,7.5,19.685039370078741,19.685039370078741,2.3622047244094491,16.5,2.6,1,0.25,4]
["ROE","JASPER 3.9",500,500,60,7.5,19.685039370078741,19.685039370078741,2.3622047244094491,16.5,3.9,1,0.25,4]
[]
["SAMSUNG","IF015H",480,540,65,null,{"$f":"C269/25.4","v":18.897637795275593},21.259842519685041,2.5590551181102366,{"$f":"F269*2.2","v":0},1.5,0.88888888888888884,{"$f":"C269*D269/1000000","v":0.25919999999999999},3.8580246913580249,"X",null,"TIL1XXIF","TILVABIF",null,504,{"$f":"T269/25.4","v":19.84251968503937},442.2,{"$f":"V269/25.4","v":17.409448818897637},"M6",null,null,"6 X 3","8 X 4","10 X 5","320 X 360",7330,7332.54,7507.14,null,"ALIGNMENT GUIDE PINS AND HOLES ON TOP AND BOTTOM OF SCREENS"]
["SAMSUNG","IF020H",480,540,65,null,18.897637795275593,21.259842519685041,2.5590551181102366,0,2,0.88888888888888884,0.25919999999999999,3.8580246913580249,"X",null,"TIL1XXIF","TILVABIF",null,504,{"$f":"T270/25.4","v":19.84251968503937},442.2,{"$f":"V270/25.4","v":17.409448818897637},"M6",null,null,"6 X 3","8 X 4","10 X 5","240 X 270",5653]
["SAMSUNG","IF025H",480,540,65,null,18.897637795275593,21.259842519685041,2.5590551181102366,0,2.5,0.88888888888888884,0.25919999999999999,3.8580246913580249,"X",null,"TIL1XXIF","TILVABIF",null,504,19.84251968503937,442.2,17.409448818897637,"M6",null,null,"6 X 3","8 X 4","10 X 5","192 X 216",3813]
["SAMSUNG","IL015E",480,540,95.7,8.9,18.897637795275593,21.259842519685041,3.7677165354330713,19.580000000000002,1.5,0.88888888888888884,0.25919999999999999,3.8580246913580249,null,"X",null,null,null,null,0,null,0]
["SAMSUNG","IL02E",480,540,95.7,8.9,18.897637795275593,21.259842519685041,3.7677165354330713,19.580000000000002,2,0.88888888888888884,0.25919999999999999,3.8580246913580249,null,"X",null,null,null,null,0,null,0]
["SAMSUNG","IL025E",480,540,95.7,8.9,18.897637795275593,21.259842519685041,3.7677165354330713,19.580000000000002,2.5,0.88888888888888884,0.25919999999999999,3.8580246913580249,null,"X",null,null,null,null,0,null,0]
["SAMSUNG","IF012J",453.6,806.4,76.7,11.8,17.858267716535433,31.748031496062993,3.0196850393700791,25.960000000000004,1.26,0.5625,0.36578304,2.7338610341255842,"X",null,null,null,null,417.6,16.440944881889767,770.4,30.330708661417322,"M6",null,null,null,null,null,null,11683.38]
["SAMSUNG","IFO25H-D",720,480,60,7.4,28.346456692913389,18.897637795275593,2.3622047244094491,16.28,2.5,1.5,0.34560000000000002,2.8935185185185182,"X",null,null,null,null,null,null,null,null,null,null,null,null,null,null,"80 X 120",null,null,null,4308]
["SAMSUNG","IFO40H-D",720,480,60,7.4,28.346456692913389,18.897637795275593,2.3622047244094491,16.28,4,1.5,0.34560000000000002,2.8935185185185182,"X",null,null,null,null,null,null,null,null,null,null,null,null,null,null,"120 X 180",null,null,null,2256]
["SAMSUNG","IFO60H-D",720,480,60,7.4,28.346456692913389,18.897637795275593,2.3622047244094491,16.28,6,1.5,0.34560000000000002,2.8935185185185182,"X",null,null,null,null,null,null,null,null,null,null,null,null,null,null,"192 X 288",null,null,null,1641]
["SAMSUNG","IW008R",453.6,806.4,29.9,11.5,17.858267716535433,31.748031496062993,1.1771653543307086,25.3,0.84,0.5625,0.36578304,2.7338610341255842,"X"]
["SAMSUNG","IW008J",453.6,806.4,72.2,12.5,17.858267716535433,31.748031496062993,2.8425196850393704,27.500000000000004,0.84,0.5625,0.36578304,2.7338610341255842,"X"]
["SAMSUNG","IE025R",540,960,79.5,10.8,21.259842519685041,37.795275590551185,3.1299212598425199,23.760000000000005,2.5,0.5625,0.51839999999999997,1.9290123456790125,"X"]
["SAMSUNG","IE040R",540,960,79.5,10.8,21.259842519685041,37.795275590551185,3.1299212598425199,23.760000000000005,4,0.5625,0.51839999999999997,1.9290123456790125,"X"]
["SAMSUNG","VM026R-I",500,500,86,8.1999999999999993,19.685039370078741,19.685039370078741,3.3858267716535435,18.04,2.6,1,0.25,4,"X"]
["SAMSUNG","VM029R-1",500,500,86,8.1999999999999993,19.685039370078741,19.685039370078741,3.3858267716535435,18.04,2.9,1,0.25,4,"X"]
["SAMSUNG","VM039R-I",500,500,86,8.1999999999999993,{"$f":"C285/25.4","v":19.685039370078741},19.685039370078741,3.3858267716535435,18.04,3.9,1,0.25,4,"X"]
["SAMSUNG","IPS030",null,null,null,null,0,0,0,0,3.1749999999999998,{"$error":"#DIV/0!"},0,{"$error":"#DIV/0!"}]
["SAMSUNG","IPS040",null,null,null,null,0,0,0,0,4.1275000000000004,{"$error":"#DIV/0!"},0,{"$error":"#DIV/0!"}]
["SAMSUNG","IPS060",null,null,null,null,0,0,0,0,6.35,{"$error":"#DIV/0!"},0,{"$error":"#DIV/0!"}]
["SAMSUNG","IPS080",null,null,null,null,0,0,0,0,8.2550000000000008,{"$error":"#DIV/0!"},0,{"$error":"#DIV/0!"}]
["SAMSUNG","IPS100",null,null,null,null,0,0,0,0,10.32,{"$error":"#DIV/0!"},0,{"$error":"#DIV/0!"}]
["SAMSUNG","IPS120",null,null,null,null,0,0,0,0,12.7,{"$error":"#DIV/0!"},0,{"$error":"#DIV/0!"}]
["SAMSUNG","IPS160",null,null,null,null,0,0,0,0,16.510000000000002,{"$error":"#DIV/0!"},0,{"$error":"#DIV/0!"}]
[]
["SANSI",null,337.5,600,75,null,{"$f":"C294/25.4","v":13.28740157480315},23.622047244094489,2.9527559055118111,{"$f":"F294/2.2","v":0},0.63,0.5625,{"$f":"C294*D294/1000000","v":0.20250000000000001},4.9382716049382713,"X"]
["SANSI",null,337.5,600,75,null,13.28740157480315,23.622047244094489,2.9527559055118111,{"$f":"F295/2.2","v":0},0.93,0.5625,0.20250000000000001,4.9382716049382713,"X"]
["SANSI",null,337.5,600,75,null,13.28740157480315,23.622047244094489,2.9527559055118111,{"$f":"F296/2.2","v":0},1.56,{"$f":"C296/D296","v":0.5625},0.20250000000000001,4.9382716049382713,"X"]
["SANSI",null,337.5,600,75,null,13.28740157480315,23.622047244094489,2.9527559055118111,{"$f":"F297/2.2","v":0},1.88,{"$f":"C297/D297","v":0.5625},0.20250000000000001,4.9382716049382713,"X"]
["SANSI","BRILLIANT INTERIOR 1.04 SMD",450,400,80,6.29,17.716535433070867,15.748031496062993,3.1496062992125986,{"$f":"F298*2.2","v":13.838000000000001},1.04,1.125,0.18,5.5555555555555554,"X"]
["SANSI","BRILLIANT INTERIOR 1.25 SMD",450,400,81,6.29,17.716535433070867,15.748031496062993,3.188976377952756,{"$f":"F299*2.2","v":13.838000000000001},1.25,1.125,0.18,5.5555555555555554,"X"]
["SANSI","BRILLIANT INTERIOR 1.56 SMD",450,400,81,6.29,17.716535433070867,15.748031496062993,3.188976377952756,{"$f":"F300*2.2","v":13.838000000000001},1.56,1.125,0.18,5.5555555555555554,"X"]
["SANSI","BRILLIANT INTERIOR 1.67 SMD",450,400,75,6.29,17.716535433070867,15.748031496062993,2.9527559055118111,{"$f":"F301*2.2","v":13.838000000000001},1.67,1.125,0.18,5.5555555555555554,"X"]
["SANSI","BRILLIANT INTERIOR 1.92 SMD",450,400,75,6.29,17.716535433070867,15.748031496062993,2.9527559055118111,{"$f":"F302*2.2","v":13.838000000000001},1.92,1.125,0.18,5.5555555555555554,"X"]
[]
["SILICONCORE","CAMELLIA P0.95",342,608,77,8.5,13.464566929133859,23.937007874015748,3.0314960629921264,18.700000000000003,0.95,0.5625,{"$f":"C304*D304/1000000","v":0.20793600000000001},4.809172052939366,"X"]
["SILICONCORE","LAVENDER 1.2 ",342,608,82,9.8000000000000007,13.464566929133859,23.937007874015748,3.2283464566929134,21.560000000000002,1.2,0.5625,0.20793600000000001,4.809172052939366,null,"X"]
["SILICONCORE","MAGNOLIA",270,480,95.4,7.2,10.62992125984252,18.897637795275593,3.7559055118110241,15.840000000000002,1.5,0.5625,0.12959999999999999,7.7160493827160499,null,"X"]
["SILICONCORE","ORCHID HD",342,608,76,9.8000000000000007,13.464566929133859,23.937007874015748,2.9921259842519685,21.560000000000002,1.9,0.5625,0.20793600000000001,4.809172052939366,null,"X"]
["SILICONCORE","DAFFODIL",342,608,76,9.9,13.464566929133859,23.937007874015748,2.9921259842519685,21.78,2.5,0.5625,0.20793600000000001,4.809172052939366,"X"]
["SILICONCORE","LILY",500,500,120,8.8000000000000007,19.685039370078741,19.685039370078741,4.7244094488188981,19.360000000000003,5.2,1,0.25,4,"X"]
["SILICONCORE","SUNFLOWER",96,480,35,null,3.7795275590551185,18.897637795275593,1.3779527559055118,0,3,0.2,4.6080000000000003E-2,21.701388888888889,"X"]
[]
["SQUARE V","Vfp0.9",337.5,600,60,8.41,{"$f":"C312/25.4","v":13.28740157480315},23.622047244094489,2.3622047244094491,{"$f":"F312*2.2","v":18.502000000000002},0.9,0.5625,{"$f":"C312*D312/1000000","v":0.20250000000000001},4.9382716049382713,null,null,null,null,null,null,null,null,null,null,null,null,null,null,null,"648 X 360"]
["SQUARE V","Vfp1.2",337.5,600,60,8.41,13.28740157480315,23.622047244094489,2.3622047244094491,{"$f":"F313*2.2","v":18.502000000000002},1.5,0.5625,{"$f":"C313*D313/1000000","v":0.20250000000000001},4.9382716049382713,null,null,null,null,null,null,null,null,null,null,null,null,null,null,null,"480 X 270"]
["SQUARE V","Vfp1.5",337.5,600,60,8.41,13.28740157480315,23.622047244094489,2.3622047244094491,{"$f":"F314*2.2","v":18.502000000000002},1.5,0.5625,{"$f":"C314*D314/1000000","v":0.20250000000000001},4.9382716049382713,null,null,null,null,null,null,null,null,null,null,null,null,null,null,null,"384 X 216"]
["SQUARE V","Vfp1.8",337.5,600,60,8.41,13.28740157480315,23.622047244094489,2.3622047244094491,{"$f":"F315*2.2","v":18.502000000000002},1.8,0.5625,{"$f":"C315*D315/1000000","v":0.20250000000000001},4.9382716049382713,null,null,null,null,null,null,null,null,null,null,null,null,null,null,null,"321 X 180"]
[]
["SONY","ZRD-1",453.6,403.2,100,10,{"$f":"C317/25.4","v":17.858267716535433},15.874015748031496,3.9370078740157481,{"$f":"F317*2.2","v":22},1.26,{"$f":"C317/D317","v":1.125},{"$f":"C317*D317/1000000","v":0.18289152},5.4677220682511685]
["SONY","ZRD-2",453.6,403.2,100,10,17.858267716535433,15.874015748031496,3.9370078740157481,{"$f":"F318*2.2","v":22},1.26,{"$f":"C318/D318","v":1.125},{"$f":"C318*D318/1000000","v":0.18289152},5.4677220682511685]
[]
["UNILUMIN","UPANEL .9S",343.08,609.91999999999996,71,7.5,13.507086614173229,24.012598425196849,2.7952755905511815,16.5,0.95299999999999996,0.5625,{"$f":"C320*D320/1000000","v":0.20925135359999997},4.7789416068083215,"X",null,"TIL1XXUU","TILVABUU",null,300,{"$f":"T320/25.4","v":11.811023622047244},470,{"$f":"V320/25.4","v":18.503937007874018},"M10",null,null,null,null,null,"640 X 360",null,null,null,null,"BOLT TOGETHER AROUND EDGE"]
["UNILUMIN","UPANEL 1.2S",343.08,609.91999999999996,71,7.5,13.507086614173229,24.012598425196849,2.7952755905511815,16.5,1.27,0.5625,0.20925135359999997,4.7789416068083215,"X",null,"TIL1XXUU","TILVABUU",null,300,{"$f":"T321/25.4","v":11.811023622047244},470,{"$f":"V321/25.4","v":18.503937007874018},"M10",null,null,null,null,null,"480 X 270",null,null,null,null,"BOLT TOGETHER AROUND EDGE"]
["UNILUMIN","UPANEL 1.5S",343.08,609.91999999999996,71,7.5,13.507086614173229,24.012598425196849,2.7952755905511815,16.5,1.58,0.5625,0.20925135359999997,4.7789416068083215,"X",null,"TIL1XXUU","TILVABUU",null,300,11.811023622047244,470,18.503937007874018,"M10",null,null,null,null,null,"384 X 216",null,null,null,null,"BOLT TOGETHER AROUND EDGE"]
["UNILUMIN","UPANEL 1.9S",343.08,609.91999999999996,71,7.5,13.507086614173229,24.012598425196849,2.7952755905511815,16.5,1.9,0.5625,0.20925135359999997,4.7789416068083215,"X",null,"TIL1XXUU","TILVABUU",null,300,11.811023622047244,470,18.503937007874018,"M10",null,null,null,null,null,"320 X 180",null,null,null,null,"BOLT TOGETHER AROUND EDGE"]
["UNILUMIN","USLIM2.6",500,500,83.3,null,19.685039370078741,19.685039370078741,3.2795275590551181,0,2.6,1,0.25,{"$f":"1/M324","v":4},"X",null,null,null,null,460,18.110236220472441,430,16.929133858267718,"M10"]
["UNILUMIN","USLIM2.6",1000,500,83.3,13,39.370078740157481,19.685039370078741,3.2795275590551181,28.6,2.6,2,0.5,2,"X",null,null,null,null,960,37.795275590551185,430,16.929133858267718,"M10"]
["UNILUMIN","USLIM3",500,500,83.3,null,19.685039370078741,19.685039370078741,3.2795275590551181,0,3.9,1,0.25,4,"X",null,null,null,null,460,18.110236220472441,430,16.929133858267718,"M10"]
["UNILUMIN","USLIM3",1000,500,83.3,13,39.370078740157481,19.685039370078741,3.2795275590551181,28.6,3.9,2,0.5,2,"X",null,null,null,null,960,37.795275590551185,430,16.929133858267718,"M10"]
["UNILUMIN","USLIM4",500,500,83.3,null,19.685039370078741,19.685039370078741,3.2795275590551181,0,null,1,0.25,4,"X",null,null,null,null,460,18.110236220472441,430,16.929133858267718,"M10"]
["UNILUMIN","USLIM4",1000,500,83.3,13,39.370078740157481,19.685039370078741,3.2795275590551181,28.6,null,2,0.5,2,"X",null,null,null,null,960,37.795275590551185,430,16.929133858267718,"M10"]
[]
["VANGUARD","AXION P0.94",null,null,null,null,{"$f":"C331/25.4","v":0},0,0,{"$f":"F331*2.2","v":0},null,{"$f":"C331/D331","v":{"$error":"#DIV/0!"}},{"$f":"C331*D331/1000000","v":0},{"$error":"#DIV/0!"}]
["VANGUARD","AXION P1.2",null,null,null,null,0,0,0,{"$f":"F332*2.2","v":0},null,{"$f":"C332/D332","v":{"$error":"#DIV/0!"}},0,{"$error":"#DIV/0!"}]
["VANGUARD","AXION P1.3",null,null,null,null,0,0,0,{"$f":"F333*2.2","v":0},null,{"$f":"C333/D333","v":{"$error":"#DIV/0!"}},0,{"$error":"#DIV/0!"}]
["VANGUARD","AXION P1.6",null,null,null,null,0,0,0,{"$f":"F334*2.2","v":0},null,{"$f":"C334/D334","v":{"$error":"#DIV/0!"}},0,{"$error":"#DIV/0!"}]
["VANGUARD","AXION P1.8",null,null,null,null,0,0,0,{"$f":"F335*2.2","v":0},null,{"$f":"C335/D335","v":{"$error":"#DIV/0!"}},0,{"$error":"#DIV/0!"}]
["VANGUARD","AXION P2.5",null,null,null,null,null,null,null,null,null,null,0,{"$error":"#DIV/0!"}]
["VANGUARD","CERIUM P1.5",300,400,66,4.5999999999999996,{"$f":"C337/25.4","v":11.811023622047244},15.748031496062993,2.598425196850394,{"$f":"F337*2.2","v":10.119999999999999},1.5,0.75,0.12,8.3333333333333339]
["VANGUARD","CERIUM P1.6",300,400,66,4.5999999999999996,11.811023622047244,15.748031496062993,2.598425196850394,10.119999999999999,1.6,0.75,0.12,8.3333333333333339]
["VANGUARD","CERIUM P1.9",300,400,66,4.5999999999999996,11.811023622047244,15.748031496062993,2.598425196850394,10.119999999999999,1.9,0.75,0.12,8.3333333333333339]
["VANGUARD","IRIDIUM P1.2",337.3,600,62,8.0500000000000007,13.279527559055119,23.622047244094489,2.4409448818897639,17.710000000000004,1.2,0.5621666666666667,0.20238,4.9411997232928151,"X"]
["VANGUARD","IRIDIUM P1.5",337.3,600,62,8.0500000000000007,13.279527559055119,23.622047244094489,2.4409448818897639,17.710000000000004,1.5,0.5621666666666667,0.20238,4.9411997232928151,"X"]
["VANGUARD","IRIDIUM P1.8",337.3,600,62,8.0500000000000007,{"$f":"C342/25.4","v":13.279527559055119},23.622047244094489,2.4409448818897639,17.710000000000004,1.8,0.5621666666666667,0.20238,4.9411997232928151,"X"]
["VANGUARD","IRIDIUM P2.5",337.3,600,62,8.0500000000000007,13.279527559055119,23.622047244094489,2.4409448818897639,17.710000000000004,2.5,0.5621666666666667,0.20238,4.9411997232928151,"X"]
["VANGUARD","RHODIUM P2.85",373.4,640,null,7.73,14.700787401574804,25.196850393700789,0,17.006000000000004,2.85,0.58343749999999994,0.23897599999999999,4.1845206213176223,"X"]
["VANGUARD","RHODIUM P3.3",373.4,640,null,7.73,14.700787401574804,25.196850393700789,0,17.006000000000004,3.3,0.58343749999999994,0.23897599999999999,4.1845206213176223,"X"]
["VANGUARD","RHODIUM P4",373.4,640,null,7.73,14.700787401574804,25.196850393700789,0,17.006000000000004,4,0.58343749999999994,0.23897599999999999,4.1845206213176223,"X"]
["VANGUARD","RHODIUM P5",373.4,640,null,7.73,14.700787401574804,25.196850393700789,0,17.006000000000004,5,0.58343749999999994,0.23897599999999999,4.1845206213176223,"X"]
["VANGUARD","RHODIUM P6.68",373.4,640,null,7.73,14.700787401574804,25.196850393700789,0,17.006000000000004,6.68,0.58343749999999994,0.23897599999999999,4.1845206213176223,"X"]
[]
["VISUAL LEADER","E0.9",610,343,62,6.5,{"$f":"C350/25.4","v":24.015748031496063},13.503937007874017,2.4409448818897639,{"$f":"F350*2.2","v":14.3},null,{"$f":"C350/D350","v":1.7784256559766765},{"$f":"C350*D350/1000000","v":0.20923},4.7794293361372651,"X"]
["VISUAL LEADER","E1.2",610,343,62,6.5,24.015748031496063,13.503937007874017,2.4409448818897639,{"$f":"F351*2.2","v":14.3},null,{"$f":"C351/D351","v":1.7784256559766765},{"$f":"C351*D351/1000000","v":0.20923},4.7794293361372651,"X"]
["VISUAL LEADER","E1.5",610,343,62,6.5,24.015748031496063,13.503937007874017,2.4409448818897639,{"$f":"F352*2.2","v":14.3},null,{"$f":"C352/D352","v":1.7784256559766765},{"$f":"C352*D352/1000000","v":0.20923},4.7794293361372651,"X"]
["VISUAL LEADER","E1.9",610,343,62,6.5,24.015748031496063,13.503937007874017,2.4409448818897639,{"$f":"F353*2.2","v":14.3},null,{"$f":"C353/D353","v":1.7784256559766765},{"$f":"C353*D353/1000000","v":0.20923},4.7794293361372651,"X"]
[]
["YES TECH",1.25,480,480,null,7,{"$f":"C355/25.4","v":18.897637795275593},18.897637795275593,0,{"$f":"F355*2.2","v":15.400000000000002},1.25,{"$f":"C355/D355","v":1},{"$f":"C355*D355/1000000","v":0.23039999999999999},4.3402777777777777,null,null,null,null,null,null,null,null,null,null,null,null,null,null,null,"384 X 384"]
["YES TECH",1.5,480,480,null,7,18.897637795275593,18.897637795275593,0,{"$f":"F356*2.2","v":15.400000000000002},1.5,{"$f":"C356/D356","v":1},{"$f":"C356*D356/1000000","v":0.23039999999999999},4.3402777777777777,null,null,null,null,null,null,null,null,null,null,null,null,null,null,null,"320 X 320 "]
["YES TECH",1.875,480,480,null,7,18.897637795275593,18.897637795275593,0,{"$f":"F357*2.2","v":15.400000000000002},1.875,{"$f":"C357/D357","v":1},{"$f":"C357*D357/1000000","v":0.23039999999999999},4.3402777777777777,null,null,null,null,null,null,null,null,null,null,null,null,null,null,null,"256 X 256"]
["YES TECH",2.5,480,480,null,7,18.897637795275593,18.897637795275593,0,{"$f":"F358*2.2","v":15.400000000000002},2.5,{"$f":"C358/D358","v":1},{"$f":"C358*D358/1000000","v":0.23039999999999999},4.3402777777777777,null,null,null,null,null,null,null,null,null,null,null,null,null,null,null,"192 X 192"]

{"sheet":"USLIM Configure Tool","index":3,"n_rows":44,"n_cols":24,"rows_kept":44,"cut":false,"hidden":false,"merged":[[4,1,4,4],[8,2,8,4],[12,1,12,3]]}
[]
[]
[]
[]
[null,"TiLED Part Number Configurator"]
[null,null,null,null,{"$f":"+C8&\" \"&E8","v":"UNILUMIN USLIM"}]
[null,null,null,null,{"$f":"IFERROR(VLOOKUP(E6,MFGSER,11,FALSE),\"\")","v":""},"acclaim p"]
[null,"Select Manufacturer","UNILUMIN","Select dvLED Series","USLIM"]
[null,{"$f":"IF(C9=\"Please Call Chief Project Manager for available options.  (952)-225-6931\",\"X\",\"Z\")","v":"Z"}]
[]
[null,"How Many Rows?\n(How many TiLES high?)\n\n1 display high = 1000mm\n0.5 displays high = 500mm","How Many Columns?\n(How many TiLES wide?)\n\n1 display wide = 500mm"]
[null,3.5,10]
[null,"For configuations taller than 10 displays high contact Chief Project Manager at (952)-225-6931 or send an email to lukas.westin@legrand.com"]
[]
[null,"Wall Mount Part #","Qty",null,"Side Cover Part #","Qty"]
[null,"TILD1X2US-L",{"$f":"(VLOOKUP(B12,typeUSLIM,2,FALSE))","v":1},null,"TILSC05HUS",{"$f":"(VLOOKUP(B12,typeUSLIM,7,FALSE))","v":1}]
[null,"TILD1X2US-M",{"$f":"(VLOOKUP(B12,typeUSLIM,2,FALSE))*(C12-1)","v":9},null,"TILSC1HUS",{"$f":"(VLOOKUP(B12,typeUSLIM,8,FALSE))","v":3}]
[null,"TILD1X2US-R",{"$f":"(VLOOKUP(B12,typeUSLIM,2,FALSE))","v":1}]
[null,"TILD1X1US-L",{"$f":"(VLOOKUP(B12,typeUSLIM,3,FALSE))","v":1}]
[null,"TILD1X1US-M",{"$f":"(VLOOKUP(B12,typeUSLIM,3,FALSE))*(C12-1)","v":9}]
[null,"TILD1X1US-R",{"$f":"(VLOOKUP(B12,typeUSLIM,3,FALSE))","v":1}]
[null,"TILD1X05US-L",{"$f":"(VLOOKUP(B12,typeUSLIM,4,FALSE))","v":1}]
[null,"TILD1X05US-M",{"$f":"(VLOOKUP(B12,typeUSLIM,4,FALSE))*(C12-1)","v":9}]
[null,"TILD1X05US-R",{"$f":"(VLOOKUP(B12,typeUSLIM,4,FALSE))","v":1}]
[null,"TILVAB2",{"$f":"(VLOOKUP(B12,typeUSLIM,5,FALSE))*(C12+1)","v":22}]
[null,"TILHDWUS",{"$f":"(VLOOKUP(B12,typeUSLIM,6,FALSE))*C12","v":40}]
[]
[]
[null,"legrandav.com/chief"]
[]
[{"$f":"+E18&F18","v":""}]
[{"$f":"+E18&F18","v":""}]
[{"$f":"+E18&F18","v":""}]
[]
[]
[]
[]
[]
[null,null,null,null,null,null,null,{"$f":"IF((AND(H38=TRUE,#REF!= TRUE)), TRUE, FALSE)","v":{"$error":"#REF!"}},{"$f":"IF((AND(I38=TRUE, H39=TRUE)), TRUE, FALSE)","v":{"$error":"#REF!"}},{"$error":"#REF!"},{"$f":"IF((AND(K38=TRUE, J39=TRUE)), TRUE, FALSE)","v":{"$error":"#REF!"}},{"$error":"#REF!"},{"$error":"#REF!"},{"$error":"#REF!"},{"$error":"#REF!"},{"$error":"#REF!"},{"$error":"#REF!"},{"$error":"#REF!"},{"$error":"#REF!"},{"$error":"#REF!"},{"$error":"#REF!"},{"$error":"#REF!"},{"$error":"#REF!"},{"$error":"#REF!"}]
[null,null,null,null,null,null,null,{"$f":"IF((AND(H39=TRUE,#REF!= TRUE)), TRUE, FALSE)","v":{"$error":"#REF!"}},{"$error":"#REF!"},{"$error":"#REF!"},{"$error":"#REF!"},{"$error":"#REF!"},{"$f":"IF((AND(M39=TRUE, L40=TRUE)), TRUE, FALSE)","v":{"$error":"#REF!"}},{"$error":"#REF!"},{"$error":"#REF!"},{"$error":"#REF!"},{"$error":"#REF!"},{"$error":"#REF!"},{"$error":"#REF!"},{"$error":"#REF!"},{"$error":"#REF!"},{"$error":"#REF!"},{"$error":"#REF!"},{"$error":"#REF!"}]
[null,null,null,null,null,null,null,{"$f":"IF((AND(H40=TRUE,#REF!= TRUE)), TRUE, FALSE)","v":{"$error":"#REF!"}},{"$f":"IF((AND(I40=TRUE, H41=TRUE)), TRUE, FALSE)","v":{"$error":"#REF!"}},{"$error":"#REF!"},{"$error":"#REF!"},{"$error":"#REF!"},{"$error":"#REF!"},{"$error":"#REF!"},{"$error":"#REF!"},{"$error":"#REF!"},{"$error":"#REF!"},{"$error":"#REF!"},{"$error":"#REF!"},{"$error":"#REF!"},{"$error":"#REF!"},{"$error":"#REF!"},{"$error":"#REF!"},{"$error":"#REF!"}]
[null,null,null,null,null,null,null,{"$f":"IF((AND(H41=TRUE,#REF!= TRUE)), TRUE, FALSE)","v":{"$error":"#REF!"}},{"$error":"#REF!"},{"$error":"#REF!"},{"$error":"#REF!"},{"$error":"#REF!"},{"$error":"#REF!"},{"$error":"#REF!"},{"$error":"#REF!"},{"$error":"#REF!"},{"$error":"#REF!"},{"$error":"#REF!"},{"$error":"#REF!"},{"$error":"#REF!"},{"$error":"#REF!"},{"$error":"#REF!"},{"$error":"#REF!"},{"$error":"#REF!"}]
[null,null,null,null,null,null,null,{"$f":"IF((AND(H42=TRUE,#REF!= TRUE)), TRUE, FALSE)","v":{"$error":"#REF!"}},{"$error":"#REF!"},{"$error":"#REF!"},{"$error":"#REF!"},{"$error":"#REF!"},{"$error":"#REF!"},{"$error":"#REF!"},{"$error":"#REF!"},{"$error":"#REF!"},{"$error":"#REF!"},{"$error":"#REF!"},{"$error":"#REF!"},{"$error":"#REF!"},{"$error":"#REF!"},{"$error":"#REF!"},{"$error":"#REF!"},{"$error":"#REF!"}]
[null,null,null,null,null,null,null,{"$f":"IF((AND(H43=TRUE,#REF!= TRUE)), TRUE, FALSE)","v":{"$error":"#REF!"}},{"$error":"#REF!"},{"$error":"#REF!"},{"$error":"#REF!"},{"$error":"#REF!"},{"$error":"#REF!"},{"$error":"#REF!"},{"$error":"#REF!"},{"$error":"#REF!"},{"$error":"#REF!"},{"$error":"#REF!"},{"$error":"#REF!"},{"$error":"#REF!"},{"$error":"#REF!"},{"$error":"#REF!"},{"$error":"#REF!"},{"$error":"#REF!"}]

{"sheet":"USLIM Tables","index":4,"n_rows":106,"n_cols":23,"rows_kept":106,"cut":false,"hidden":true,"merged":[]}
["Display Sizes"]
["500mm W x 500mm H"," equals 1/2 display tall",null,null,null,null,null,null,null,"Named Range:",null,"typeUSLIM"]
["500mm W x 1000mm H"," equals 1 display tall",null,null,null,null,null,null,null,"1x2, 1x3, 1x4"]
[]
["Unilumin USLIM (13 skus)",null,null,null,null,null,null,null,null,null,"2000mm","1000m","500mm","TILVAB2","TILHDWUS","TILSC05HUS","TILSC1HUS"]
["Part Number","Description","Rules",null,null,null,null,null,"Row Height",1,2,3,4,5,6,7,8,9,10,11,null,null,"Columns Width"]
["TILD1X05US-L","UPPER LEFT, DUAL FEET, 500 mm","Left Side only, 500mm tall only",null,null,null,null,null,null,1,null,1,null,0,{"$f":"ROUNDUP(J7,0)","v":1},null,1,null,null,null,null,null,1]
["TILD1X05US-M","UPPER MIDDLE, DUAL FEET, 500 mm","Middle only, 500mm tall only",null,null,null,null,null,null,1.5,null,1,1,{"$f":"(SUM(K8:M8)-1)","v":1},{"$f":"ROUNDUP(J8,0)","v":2},1,1,null,null,null,null,null,2]
["TILD1X05US-R","UPPER RIGHT, DUAL FEET, 500 mm","Right Side only, 500mm tall only",null,null,null,null,null,null,2,1,null,null,{"$f":"(SUM(K9:M9)-1)","v":0},2,null,2,null,null,null,null,null,3]
["TILD1X1US-L","UPPER LEFT, DUAL FEET, 1000 mm","Left Side only, 1000mm tall only",null,null,null,null,null,null,2.5,1,null,1,1,3,1,2,null,null,null,null,null,4]
["TILD1X1US-M","UPPER MIDDLE, DUAL FEET, 1000 mm","Middle only, 1000mm tall only",null,null,null,null,null,null,3,1,1,null,1,3,null,3,null,null,null,null,null,5]
["TILD1X1US-R","UPPER RIGHT, DUAL FEET, 1000 mm","Right Side only, 10000mm tall only",null,null,null,null,null,null,3.5,1,1,1,2,4,1,3,null,null,null,null,null,6]
["TILD1X2US-L","UPPER LEFT, DUAL FEET, 2000 mm","Left Side only, 2000mm tall only",null,null,null,null,null,null,4,2,null,null,1,4,null,4,null,null,null,null,null,7]
["TILD1X2US-M","UPPER MIDDLE, DUAL FEET, 2000 mm","Middle only, 2000mm tall only",null,null,null,null,null,null,4.5,2,null,1,2,5,1,4,null,null,null,null,null,8]
["TILD1X2US-R","UPPER RIGHT, DUAL FEET, 2000 mm","Right Side only, 20000mm tall only",null,null,null,null,null,null,5,2,1,null,2,5,null,5,null,null,null,null,null,9]
["TILVAB2","USLIM VERTICAL CONNNECTOR","only used in between mounts (1 per)",null,null,null,null,null,null,5.5,2,1,1,3,6,1,5,null,null,null,null,null,10]
["TILHDWUS","USLIM HARDWARE BAG","1 per display",null,null,null,null,null,null,6,3,null,null,2,6,null,6,null,null,null,null,null,11]
["TILSC05HUS","USLIM SIDE COVER, 500 mm HIGH","1 per 500mm or 1/2 display tall",null,null,null,null,null,null,6.5,3,null,1,3,7,1,6,null,null,null,null,null,12]
["TILSC1HUS","USLIM SIDE COVER, 1000 mm HIGH","1 per 1000mm or 1 display tall",null,null,null,null,null,null,7,2,1,null,2,7,null,7,null,null,null,null,null,13]
[null,null,null,null,null,null,null,null,null,7.5,2,1,1,3,8,1,7,null,null,null,null,null,14]
[null,null,null,null,null,null,null,null,null,8,4,null,null,3,8,null,8,null,null,null,null,null,15]
[null,null,null,null,null,null,null,null,null,8.5,4,null,1,4,9,1,8,null,null,null,null,null,16]
["rows",3.5,null,null,null,null,null,null,null,9,4,1,1,5,9,null,9,null,null,null,null,null,17]
["columns",10,null,null,null,null,null,null,null,9.5,4,1,1,5,10,1,9,null,null,null,null,null,18]
[null,null,null,null,null,null,null,null,null,10,5,null,null,4,10,null,10,null,null,null,null,null,19]
["part number","description","qty",null,null,null,null,null,null,10.5,5,null,1,5,11,1,10,null,null,null,null,null,20]
["TILD1X2US-L","UPPER LEFT, DUAL FEET, 2000 mm",10,null,null,null,null,null,null,11,5,1,null,5,11,null,11,null,null,null,null,null,21]
["TILD1X2US-M","UPPER MIDDLE, DUAL FEET, 2000 mm",10,null,null,null,null,null,null,11.5,5,1,1,6,12,1,11,null,null,null,null,null,22]
["TILD1X2US-R","UPPER RIGHT, DUAL FEET, 2000 mm",10,null,null,null,null,null,null,12,6,null,null,5,12,null,12,null,null,null,null,null,23]
["TILD1X1US-L","UPPER LEFT, DUAL FEET, 1000 mm",10,null,null,null,null,null,null,12.5,6,null,1,6,13,1,12,null,null,null,null,null,24]
["TILD1X1US-M","UPPER MIDDLE, DUAL FEET, 1000 mm",10,null,null,null,null,null,null,13,6,1,null,6,13,null,13,null,null,null,null,null,25]
["TILD1X1US-R","UPPER RIGHT, DUAL FEET, 1000 mm",10,null,null,null,null,null,null,13.5,6,1,1,7,14,1,13,null,null,null,null,null,26]
["TILD1X05US-L","UPPER LEFT, DUAL FEET, 500 mm",10,null,null,null,null,null,null,14,7,null,null,6,14,null,14,null,null,null,null,null,27]
["TILD1X05US-M","UPPER MIDDLE, DUAL FEET, 500 mm",10,null,null,null,null,null,null,14.5,7,null,1,7,15,1,14,null,null,null,null,null,28]
["TILD1X05US-R","UPPER RIGHT, DUAL FEET, 500 mm",10,null,null,null,null,null,null,15,7,1,null,7,15,null,15,null,null,null,null,null,29]
["TILVAB2","USLIM VERTICAL CONNNECTOR",22,null,null,null,null,null,null,15.5,7,1,1,8,16,1,15,null,null,null,null,null,30]
["TILHDWUS","USLIM HARDWARE BAG",null,null,null,null,null,null,null,16,8,null,null,7,16,null,16,null,null,null,null,null,31]
[null,null,null,null,null,null,null,null,null,16.5,8,null,1,8,17,1,16,null,null,null,null,null,32]
[null,null,null,null,null,null,null,null,null,17,8,1,null,8,17,null,17,null,null,null,null,null,33]
[null,null,null,null,null,null,null,null,null,17.5,8,1,1,9,18,1,17,null,null,null,null,null,34]
[null,null,null,null,null,null,null,null,null,18,9,null,null,8,18,null,18,null,null,null,null,null,35]
[null,null,null,null,null,null,null,null,null,18.5,9,null,1,9,19,1,18,null,null,null,null,null,36]
[null,null,null,null,null,null,null,null,null,19,9,1,null,9,19,null,19,null,null,null,null,null,37]
[null,null,null,null,null,null,null,null,null,19.5,9,1,1,10,20,1,19,null,null,null,null,null,38]
[null,null,null,null,null,null,null,null,null,20,10,null,null,9,20,null,20,null,null,null,null,null,39]
[null,null,null,null,null,null,null,null,null,null,null,null,null,null,null,null,null,null,null,null,null,null,40]
[null,null,null,null,null,null,null,null,null,null,null,null,null,null,null,null,null,null,null,null,null,null,41]
[null,null,null,null,null,null,null,null,null,null,null,null,null,null,null,null,null,null,null,null,null,null,42]
[null,null,null,null,null,null,null,null,null,null,null,null,null,null,null,null,null,null,null,null,null,null,43]
[null,null,null,null,null,null,null,null,null,null,null,null,null,null,null,null,null,null,null,null,null,null,44]
[null,null,null,null,null,null,null,null,null,null,null,null,null,null,null,null,null,null,null,null,null,null,45]
[null,null,null,null,null,null,null,null,null,null,null,null,null,null,null,null,null,null,null,null,null,null,46]
[null,null,null,null,null,null,null,null,null,null,null,null,null,null,null,null,null,null,null,null,null,null,47]
[null,null,null,null,null,null,null,null,null,null,null,null,null,null,null,null,null,null,null,null,null,null,48]
[null,null,null,null,null,null,null,null,null,null,null,null,null,null,null,null,null,null,null,null,null,null,49]
[null,null,null,null,null,null,null,null,null,null,null,null,null,null,null,null,null,null,null,null,null,null,50]
[null,null,null,null,null,null,null,null,null,null,null,null,null,null,null,null,null,null,null,null,null,null,51]
[null,null,null,null,null,null,null,null,null,null,null,null,null,null,null,null,null,null,null,null,null,null,52]
[null,null,null,null,null,null,null,null,null,null,null,null,null,null,null,null,null,null,null,null,null,null,53]
[null,null,null,null,null,null,null,null,null,null,null,null,null,null,null,null,null,null,null,null,null,null,54]
[null,null,null,null,null,null,null,null,null,null,null,null,null,null,null,null,null,null,null,null,null,null,55]
[null,null,null,null,null,null,null,null,null,null,null,null,null,null,null,null,null,null,null,null,null,null,56]
[null,null,null,null,null,null,null,null,null,null,null,null,null,null,null,null,null,null,null,null,null,null,57]
[null,null,null,null,null,null,null,null,null,null,null,null,null,null,null,null,null,null,null,null,null,null,58]
[null,null,null,null,null,null,null,null,null,null,null,null,null,null,null,null,null,null,null,null,null,null,59]
[null,null,null,null,null,null,null,null,null,null,null,null,null,null,null,null,null,null,null,null,null,null,60]
[null,null,null,null,null,null,null,null,null,null,null,null,null,null,null,null,null,null,null,null,null,null,61]
[null,null,null,null,null,null,null,null,null,null,null,null,null,null,null,null,null,null,null,null,null,null,62]
[null,null,null,null,null,null,null,null,null,null,null,null,null,null,null,null,null,null,null,null,null,null,63]
[null,null,null,null,null,null,null,null,null,null,null,null,null,null,null,null,null,null,null,null,null,null,64]
[null,null,null,null,null,null,null,null,null,null,null,null,null,null,null,null,null,null,null,null,null,null,65]
[null,null,null,null,null,null,null,null,null,null,null,null,null,null,null,null,null,null,null,null,null,null,66]
[null,null,null,null,null,null,null,null,null,null,null,null,null,null,null,null,null,null,null,null,null,null,67]
[null,null,null,null,null,null,null,null,null,null,null,null,null,null,null,null,null,null,null,null,null,null,68]
[null,null,null,null,null,null,null,null,null,null,null,null,null,null,null,null,null,null,null,null,null,null,69]
[null,null,null,null,null,null,null,null,null,null,null,null,null,null,null,null,null,null,null,null,null,null,70]
[null,null,null,null,null,null,null,null,null,null,null,null,null,null,null,null,null,null,null,null,null,null,71]
[null,null,null,null,null,null,null,null,null,null,null,null,null,null,null,null,null,null,null,null,null,null,72]
[null,null,null,null,null,null,null,null,null,null,null,null,null,null,null,null,null,null,null,null,null,null,73]
[null,null,null,null,null,null,null,null,null,null,null,null,null,null,null,null,null,null,null,null,null,null,74]
[null,null,null,null,null,null,null,null,null,null,null,null,null,null,null,null,null,null,null,null,null,null,75]
[null,null,null,null,null,null,null,null,null,null,null,null,null,null,null,null,null,null,null,null,null,null,76]
[null,null,null,null,null,null,null,null,null,null,null,null,null,null,null,null,null,null,null,null,null,null,77]
[null,null,null,null,null,null,null,null,null,null,null,null,null,null,null,null,null,null,null,null,null,null,78]
[null,null,null,null,null,null,null,null,null,null,null,null,null,null,null,null,null,null,null,null,null,null,79]
[null,null,null,null,null,null,null,null,null,null,null,null,null,null,null,null,null,null,null,null,null,null,80]
[null,null,null,null,null,null,null,null,null,null,null,null,null,null,null,null,null,null,null,null,null,null,81]
[null,null,null,null,null,null,null,null,null,null,null,null,null,null,null,null,null,null,null,null,null,null,82]
[null,null,null,null,null,null,null,null,null,null,null,null,null,null,null,null,null,null,null,null,null,null,83]
[null,null,null,null,null,null,null,null,null,null,null,null,null,null,null,null,null,null,null,null,null,null,84]
[null,null,null,null,null,null,null,null,null,null,null,null,null,null,null,null,null,null,null,null,null,null,85]
[null,null,null,null,null,null,null,null,null,null,null,null,null,null,null,null,null,null,null,null,null,null,86]
[null,null,null,null,null,null,null,null,null,null,null,null,null,null,null,null,null,null,null,null,null,null,87]
[null,null,null,null,null,null,null,null,null,null,null,null,null,null,null,null,null,null,null,null,null,null,88]
[null,null,null,null,null,null,null,null,null,null,null,null,null,null,null,null,null,null,null,null,null,null,89]
[null,null,null,null,null,null,null,null,null,null,null,null,null,null,null,null,null,null,null,null,null,null,90]
[null,null,null,null,null,null,null,null,null,null,null,null,null,null,null,null,null,null,null,null,null,null,91]
[null,null,null,null,null,null,null,null,null,null,null,null,null,null,null,null,null,null,null,null,null,null,92]
[null,null,null,null,null,null,null,null,null,null,null,null,null,null,null,null,null,null,null,null,null,null,93]
[null,null,null,null,null,null,null,null,null,null,null,null,null,null,null,null,null,null,null,null,null,null,94]
[null,null,null,null,null,null,null,null,null,null,null,null,null,null,null,null,null,null,null,null,null,null,95]
[null,null,null,null,null,null,null,null,null,null,null,null,null,null,null,null,null,null,null,null,null,null,96]
[null,null,null,null,null,null,null,null,null,null,null,null,null,null,null,null,null,null,null,null,null,null,97]
[null,null,null,null,null,null,null,null,null,null,null,null,null,null,null,null,null,null,null,null,null,null,98]
[null,null,null,null,null,null,null,null,null,null,null,null,null,null,null,null,null,null,null,null,null,null,99]
[null,null,null,null,null,null,null,null,null,null,null,null,null,null,null,null,null,null,null,null,null,null,100]

{"sheet":"Samsung IER IFR IEA Conf. Tool ","index":5,"n_rows":31,"n_cols":6,"rows_kept":31,"cut":false,"hidden":false,"merged":[[4,1,4,4],[8,2,8,4],[12,1,12,3]]}
[]
[]
[]
[]
[null,"TiLED Part Number Configurator"]
[null,null,null,null,{"$f":"+C8&\" \"&E8","v":"Samsung IER/IFR/IEA & -F models"}]
[null,null,null,null,{"$f":"IFERROR(VLOOKUP(E6,MFGSER,11,FALSE),\"\")","v":""},"acclaim p"]
[null,"Select Manufacturer","Samsung","Select dvLED Series","IER/IFR/IEA & -F models"]
[null,{"$f":"IF(C9=\"Please Call Chief Project Manager for available options.  (952)-225-6931\",\"X\",\"Z\")","v":"Z"}]
[]
[null,"How Many Rows?\n(How many TiLES high?)","How Many Columns?\n(How many TiLES wide?)"]
[null,6,6]
[null,"For configuations taller than 10 displays high contact Chief Project Manager at (952)-225-6931 or send an email to lukas.westin@legrand.com"]
[]
[null,"Wall Mount Part #","Qty",null,"Side Cover Part #","Qty"]
[null,"TILD1X2IER-L ",{"$f":"(VLOOKUP($B$12,typeIER,3,FALSE))","v":0},null,"TILSC2HIFH",{"$f":"(VLOOKUP(B12,typeIER,5,FALSE))","v":0}]
[null,"TILD1X2IER-M ",{"$f":"(VLOOKUP(B12,typeIER,3,FALSE))*(ROUNDDOWN(C12,0)-1)","v":0},null,"TILSC3HIFH",{"$f":"(VLOOKUP(B12,typeIER,6,FALSE))","v":2}]
[null,"TILD1X2IER-R ",{"$f":"(VLOOKUP(B12,typeIER,3,FALSE))","v":0}]
[null,"TILD1X3IER-L ",{"$f":"(VLOOKUP(B12,typeIER,2,FALSE))","v":2}]
[null,"TILD1X3IER-M",{"$f":"(VLOOKUP(B12,typeIER,2,FALSE))*(ROUNDDOWN(C12,0)-1)","v":10},null,null,"Easier, cost-saving installation"]
[null,"TILD1X3IER-R ",{"$f":"(VLOOKUP(B12,typeIER,2,FALSE))","v":2}]
[null,"TILD1X2IERF",{"$f":"(VLOOKUP($B$12,typeIER,3,FALSE))*(VLOOKUP(C12-TRUNC(C12,0),'IER Tables '!F6:G9,2,FALSE))","v":0}]
[null,"TILD1X3IERF",{"$f":"(VLOOKUP(B12,typeIER,2,FALSE))*(VLOOKUP(C12-TRUNC(C12,0),'IER Tables '!F6:G9,2,FALSE))","v":0}]
[null,"TILVAB1",{"$f":"((VLOOKUP(B12,typeIER,4,FALSE))*(ROUNDDOWN(C12,0)))+((VLOOKUP(B12,typeIER,4,FALSE))*(VLOOKUP(C12-TRUNC(C12,0),'IER Tables '!F6:G9,2,FALSE)))","v":6}]
[]
[]
[null,"legrandav.com/chief"]
[]
[{"$f":"+E18&F18","v":""}]
[{"$f":"+E18&F18","v":""}]
[{"$f":"+E18&F18","v":""}]

{"sheet":"IER Tables ","index":6,"n_rows":63,"n_cols":21,"rows_kept":63,"cut":false,"hidden":true,"merged":[]}
[]
[null,null,null,null,null,null,null,null,null,null,"Named Range:",null,"typeIER-F column width ",null,null,null,"Named Range:",null,"typeIER"]
[null,null,null,null,null,"Named Range:",null,"typeIER-F column width multiplier",null,null,"1x2, 1x3",null,null,null,null,null,"1x2, 1x3, 1x4"]
[null,null,null,null,null,"1x2, 1x3"]
[null,null,null,null,null,null,null,null,null,null,null,null,null,null,null,null,"3 high","2 high","TILVAB1","TILSC2HIFH","TILSC3HIFH"]
[null,null,null,null,null,0,0,null,null,"Columns Width",1,2,null,null,"Row Height",1,2,3,4,5,6]
["Part Number","Description","Rules",null,null,0.25,1,null,null,1,1,0,null,null,null,1]
["TILD1X2IER-L ","TiLED SAMSUNG IER WALL MOUNT, 2 HIGH, LEFT","Left Side only, 2 displays tall",null,null,0.5,2,null,null,2,1.25,1,null,null,null,2,null,1,{"$f":"SUM(Q8:R8)-1","v":0},1]
["TILD1X2IER-M ","TiLED SAMSUNG IER WALL MOUNT, 2 HIGH, MIDDLE","Middle only, 2 displays tall",null,null,0.75,3,null,null,3,1.5,2,null,null,null,3,1,null,{"$f":"SUM(Q9:R9)-1","v":0},null,1]
["TILD1X2IER-R ","TiLED SAMSUNG IER WALL MOUNT, 2 HIGH, RIGHT","Right Side only, 2 displays tall",null,null,null,null,null,null,4,1.75,3,null,null,null,4,null,2,1,2]
["TILD1X3IER-L ","TiLED SAMSUNG IER WALL MOUNT, 3 HIGH, LEFT","Left Side only, 3 displays tall",null,null,null,null,null,null,5,2,0,null,null,null,5,1,1,1,1,1]
["TILD1X3IER-M","TiLED SAMSUNG IER WALL MOUNT, 3 HIGH, MIDDLE","Middle only, 3 displays tall",null,null,null,null,null,null,6,2.25,1,null,null,null,6,2,null,1,null,2]
["TILD1X3IER-R ","TiLED SAMSUNG IER WALL MOUNT, 3 HIGH, RIGHT","Right Side only, 3 displays tall",null,null,null,null,null,null,7,2.5,2,null,null,null,7,1,2,2,2,1]
["TILD1X2IERF","TiLED SAMSUNG IER-F WALL MOUNT, 2 HIGH, ","1/4, 1/2 or 3/4 wide, 2 displays tall, used on sides of configuraion only, only connects to TILD1X2IER-L  & TILD1X2IER-R",null,null,null,null,null,null,8,2.75,3,null,null,null,8,2,1,2,1,2]
["TILD1X3IERF","TiLED SAMSUNG IER-F WALL MOUNT, 3 HIGH, ","1/4, 1/2 or 3/4 wide, 2 displays tall, used on sides of configuraion only, only connects to TILD1X3IER-L  & TILD1X3IER-R",null,null,null,null,null,null,9,3,0,null,null,null,9,3,null,2,null,3]
["TILSC2HIFH","TiLED SAMSUNG IFH/IER SIDE COVER , 2 HIGH","Side Cover, 2 displays tall, used on sides of configuraion only, only connects to TILD1X2IER-L  & TILD1X2IER-R",null,null,null,null,null,null,10,3.25,1,null,null,null,10,2,2,3,2,2]
["TILSC3HIFH","TiLED SAMSUNG IFH/IER SIDE COVER , 3 HIGH","Side Cover, 3 displays tall, used on sides of configuraion only, only connects to TILD1X3IER-L  & TILD1X3IER-R",null,null,null,null,null,null,11,3.5,2,null,null,null,11,3,1,3,1,3]
["TILVAB1","VERTICAL CONNECTOR","only used in between mounts 1 per middles, 0.5 per left & right, 1 between -F models",null,null,null,null,null,null,12,3.75,3,null,null,null,12,4,null,3,null,4]
[null,null,null,null,null,null,null,null,null,13,4,0,null,null,null,13,3,2,4,2,3]
[null,null,null,null,null,null,null,null,null,14,4.25,1,null,null,null,14,4,1,4,1,4]
[null,null,null,null,null,null,null,null,null,15,4.5,2,null,null,null,15,5,null,4,null,5]
[null,null,null,null,null,null,null,null,null,16,4.75,3,null,null,null,16,4,2,5,2,4]
[null,null,null,null,null,null,null,null,null,17,5,0,null,null,null,17,5,1,5,1,5]
[null,null,null,null,null,null,null,null,null,18,5.25,1,null,null,null,18,6,null,5,null,6]
[null,null,null,null,null,null,null,null,null,19,5.5,2,null,null,null,19,5,2,6,2,5]
[null,null,null,null,null,null,null,null,null,20,5.75,3,null,null,null,20,6,1,6,1,6]
[null,null,null,null,null,null,null,null,null,21,6,0,null,null,null,21,7,null,6,null,7]
[null,null,null,null,null,null,null,null,null,22,6.25,1,null,null,null,22,6,2,7,2,6]
[null,null,null,null,null,null,null,null,null,23,6.5,2,null,null,null,23,7,1,7,1,7]
[null,null,null,null,null,null,null,null,null,24,6.75,3,null,null,null,24,8,null,7,null,8]
[null,null,null,null,null,null,null,null,null,25,7,0,null,null,null,25,7,2,8,2,7]
[null,null,null,null,null,null,null,null,null,26,7.25,1,null,null,null,26,8,1,8,1,8]
[null,null,null,null,null,null,null,null,null,27,7.5,2,null,null,null,27,9,null,8,null,9]
[null,null,null,null,null,null,null,null,null,28,7.75,3,null,null,null,28,8,2,9,2,8]
[null,null,null,null,null,null,null,null,null,29,8,0,null,null,null,29,9,1,9,1,9]
[null,null,null,null,null,null,null,null,null,30,8.25,1,null,null,null,30,10,null,9,null,10]
[null,null,null,null,null,null,null,null,null,null,8.5,2]
[null,null,null,null,null,null,null,null,null,null,8.75,3]
[null,null,null,null,null,null,null,null,null,null,9,0]
[null,null,null,null,null,null,null,null,null,null,9.25,1]
[null,null,null,null,null,null,null,null,null,null,9.5,2]
[null,null,null,null,null,null,null,null,null,null,9.75,3]
[null,null,null,null,null,null,null,null,null,null,10,0]
[null,null,null,null,null,null,null,null,null,null,10.25,1]
[null,null,null,null,null,null,null,null,null,null,10.5,2]
["old TILVAB1 formula",null,null,null,null,null,null,null,null,null,10.75,3]
[{"$f":"(VLOOKUP(B12,typeIER,4,FALSE))*(ROUNDDOWN(C12,0))","v":{"$error":"#N/A"}},null,null,null,null,null,null,null,null,null,11,0]
[null,null,null,null,null,null,null,null,null,null,11.25,1]
[null,null,null,null,null,null,null,null,null,null,11.5,2]
[null,null,null,null,null,null,null,null,null,null,11.75,3]
[null,null,null,null,null,null,null,null,null,null,12,0]
[null,null,null,null,null,null,null,null,null,null,12.25,1]
[null,null,null,null,null,null,null,null,null,null,12.5,2]
[null,null,null,null,null,null,null,null,null,null,12.75,3]
[null,null,null,null,null,null,null,null,null,null,13,0]
[null,null,null,null,null,null,null,null,null,null,13.25,1]
[null,null,null,null,null,null,null,null,null,null,13.5,2]
[null,null,null,null,null,null,null,null,null,null,13.75,3]
[null,null,null,null,null,null,null,null,null,null,14,0]
[null,null,null,null,null,null,null,null,null,null,14.25,1]
[null,null,null,null,null,null,null,null,null,null,14.5,2]
[null,null,null,null,null,null,null,null,null,null,14.75,3]
[null,null,null,null,null,null,null,null,null,null,15,0]

{"sheet":"Sony Configure Tool","index":7,"n_rows":44,"n_cols":19,"rows_kept":44,"cut":false,"hidden":false,"merged":[[4,1,4,4],[7,4,7,5],[8,2,8,4],[12,1,12,3]]}
[]
[]
[]
[]
[null,"TiLED Part Number Configurator"]
[null,null,null,null,{"$f":"+C8&\" \"&E8","v":"Sony Crystal LED B&C Series"}]
[null,null,null,null,{"$f":"IFERROR(VLOOKUP(E6,MFGSER,11,FALSE),\"\")","v":""},"acclaim p"]
[null,"Select Manufacturer","Sony","Select dvLED Series","Crystal LED B&C Series"]
[null,{"$f":"IF(C9=\"Please Call Chief Project Manager for available options.  (952)-225-6931\",\"X\",\"Z\")","v":"Z"}]
[]
[null,"How Many Rows?\n(How many TiLES high?)\n\n","How Many Columns?\n(How many TiLES wide?)\n\n"]
[null,6,6]
[null,"For configuations taller than 10 displays high contact Chief Project Manager at (952)-225-6931 or send an email to lukas.westin@legrand.com"]
[]
[null,"Wall Mount Part #","Qty",null,"Side Cover Part #","Qty"]
[null,"TILD1X3S01-L",{"$f":"(VLOOKUP(B12,typeUSLIM,4,FALSE))","v":2},null,"TILSC2HSO1",{"$f":"(VLOOKUP(B12,typeUSLIM,7,FALSE))","v":0}]
[null,"TILD1X3SO1-M",{"$f":"(VLOOKUP(B12,typeUSLIM,4,FALSE))*(C12-1)","v":10},null,"TILSC3HSO1",{"$f":"(VLOOKUP(B12,typeUSLIM,8,FALSE))","v":2}]
[null,"TILD1X3SO1-R",{"$f":"(VLOOKUP(B12,typeUSLIM,4,FALSE))","v":2}]
[null,"TILD1X4S01-L",{"$f":"(VLOOKUP(B12,typeUSLIM,3,FALSE))","v":0}]
[null,"TILD1X4SO1-M",{"$f":"(VLOOKUP(B12,typeUSLIM,3,FALSE))*(C12-1)","v":0}]
[null,"TILD1X4SO1-R",{"$f":"(VLOOKUP(B12,typeUSLIM,3,FALSE))","v":0}]
[null,"TILD1X5S01-L",{"$f":"(VLOOKUP(B12,typeUSLIM,2,FALSE))","v":0}]
[null,"TILD1X5SO1-M",{"$f":"(VLOOKUP(B12,typeUSLIM,2,FALSE))*(C12-1)","v":0}]
[null,"TILD1X5SO1-R",{"$f":"(VLOOKUP(B12,typeUSLIM,2,FALSE))","v":0}]
[null,"TILVAB1",{"$f":"(VLOOKUP(B12,typeUSLIM,5,FALSE))*(C12+1)","v":7}]
[null,"TILHDW1",{"$f":"(VLOOKUP(B12,typeUSLIM,6,FALSE))*C12","v":36}]
[]
[]
[null,"legrandav.com/chief"]
[]
[{"$f":"+#REF!&G18","v":{"$error":"#REF!"}}]
[{"$f":"+#REF!&G18","v":{"$error":"#REF!"}}]
[{"$f":"+#REF!&G18","v":{"$error":"#REF!"}}]
[]
[]
[]
[]
[]
[null,null,null,null,null,null,null,{"$f":"IF((AND(H38=TRUE,#REF!= TRUE)), TRUE, FALSE)","v":{"$error":"#REF!"}},{"$f":"IF((AND(I38=TRUE, H39=TRUE)), TRUE, FALSE)","v":{"$error":"#REF!"}},{"$f":"IF((AND(J38=TRUE,#REF!= TRUE)), TRUE, FALSE)","v":{"$error":"#REF!"}},{"$f":"IF((AND(K38=TRUE,#REF!= TRUE)), TRUE, FALSE)","v":{"$error":"#REF!"}},{"$f":"IF((AND(L38=TRUE,#REF!= TRUE)), TRUE, FALSE)","v":{"$error":"#REF!"}},{"$error":"#REF!"},{"$error":"#REF!"},{"$error":"#REF!"},{"$error":"#REF!"},{"$error":"#REF!"},{"$error":"#REF!"},{"$error":"#REF!"}]
[null,null,null,null,null,null,null,{"$f":"IF((AND(H39=TRUE,#REF!= TRUE)), TRUE, FALSE)","v":{"$error":"#REF!"}},{"$error":"#REF!"},{"$f":"IF((AND(J39=TRUE,#REF!= TRUE)), TRUE, FALSE)","v":{"$error":"#REF!"}},{"$f":"IF((AND(K39=TRUE,#REF!= TRUE)), TRUE, FALSE)","v":{"$error":"#REF!"}},{"$f":"IF((AND(L39=TRUE,#REF!= TRUE)), TRUE, FALSE)","v":{"$error":"#REF!"}},{"$error":"#REF!"},{"$error":"#REF!"},{"$error":"#REF!"},{"$error":"#REF!"},{"$error":"#REF!"},{"$error":"#REF!"},{"$error":"#REF!"}]
[null,null,null,null,null,null,null,{"$f":"IF((AND(H40=TRUE,#REF!= TRUE)), TRUE, FALSE)","v":{"$error":"#REF!"}},{"$error":"#REF!"},{"$f":"IF((AND(J40=TRUE,#REF!= TRUE)), TRUE, FALSE)","v":{"$error":"#REF!"}},{"$f":"IF((AND(K40=TRUE,#REF!= TRUE)), TRUE, FALSE)","v":{"$error":"#REF!"}},{"$f":"IF((AND(L40=TRUE,#REF!= TRUE)), TRUE, FALSE)","v":{"$error":"#REF!"}},{"$error":"#REF!"},{"$error":"#REF!"},{"$error":"#REF!"},{"$error":"#REF!"},{"$error":"#REF!"},{"$error":"#REF!"},{"$error":"#REF!"}]
[null,null,null,null,null,null,null,{"$f":"IF((AND(H41=TRUE,#REF!= TRUE)), TRUE, FALSE)","v":{"$error":"#REF!"}},{"$error":"#REF!"},{"$f":"IF((AND(J41=TRUE,#REF!= TRUE)), TRUE, FALSE)","v":{"$error":"#REF!"}},{"$f":"IF((AND(K41=TRUE,#REF!= TRUE)), TRUE, FALSE)","v":{"$error":"#REF!"}},{"$f":"IF((AND(L41=TRUE,#REF!= TRUE)), TRUE, FALSE)","v":{"$error":"#REF!"}},{"$error":"#REF!"},{"$error":"#REF!"},{"$error":"#REF!"},{"$error":"#REF!"},{"$error":"#REF!"},{"$error":"#REF!"},{"$error":"#REF!"}]
[null,null,null,null,null,null,null,{"$f":"IF((AND(H42=TRUE,#REF!= TRUE)), TRUE, FALSE)","v":{"$error":"#REF!"}},{"$error":"#REF!"},{"$f":"IF((AND(J42=TRUE,#REF!= TRUE)), TRUE, FALSE)","v":{"$error":"#REF!"}},{"$f":"IF((AND(K42=TRUE,#REF!= TRUE)), TRUE, FALSE)","v":{"$error":"#REF!"}},{"$f":"IF((AND(L42=TRUE,#REF!= TRUE)), TRUE, FALSE)","v":{"$error":"#REF!"}},{"$error":"#REF!"},{"$error":"#REF!"},{"$error":"#REF!"},{"$error":"#REF!"},{"$error":"#REF!"},{"$error":"#REF!"},{"$error":"#REF!"}]
[null,null,null,null,null,null,null,{"$f":"IF((AND(H43=TRUE,#REF!= TRUE)), TRUE, FALSE)","v":{"$error":"#REF!"}},{"$error":"#REF!"},{"$f":"IF((AND(J43=TRUE,#REF!= TRUE)), TRUE, FALSE)","v":{"$error":"#REF!"}},{"$f":"IF((AND(K43=TRUE,#REF!= TRUE)), TRUE, FALSE)","v":{"$error":"#REF!"}},{"$f":"IF((AND(L43=TRUE,#REF!= TRUE)), TRUE, FALSE)","v":{"$error":"#REF!"}},{"$error":"#REF!"},{"$error":"#REF!"},{"$error":"#REF!"},{"$error":"#REF!"},{"$error":"#REF!"},{"$error":"#REF!"},{"$error":"#REF!"}]

{"sheet":"Sony Tables","index":8,"n_rows":36,"n_cols":18,"rows_kept":36,"cut":false,"hidden":true,"merged":[]}
[]
[null,"Named Range:",null,"typeUSLIM"]
[null,"1x2, 1x3, 1x4"]
[null,null,5,4,3,null,null,2,3]
[null,null,"5 HIGH","4 HIGH","3 HIGH","TILVAB1","TILHDW1","TILSC2HSO1","TILSC3HSO1",null,null,null,null,null,null,null,null,"Wall Mount Part #"]
["Row Height",1,2,3,4,5,6,7,8,9,10,11,null,null,"Columns Width",null,null,"TILD1X3S01-L"]
[null,1,null,null,null,null,null,null,null,null,null,null,null,null,1,null,null,"TILD1X3SO1-M"]
[null,2,null,null,null,null,null,null,null,null,null,null,null,null,2,null,null,"TILD1X3SO1-R"]
[{"$f":"(C9*$C$4)+(D9*$D$4)+(E9*$E$4)","v":3},3,null,null,1,{"$f":"(SUM(C9:E9)-1)","v":0},{"$f":"ROUNDUP(B9,0)","v":3},null,1,null,null,null,{"$f":"(H9*$H$4)+(I9*$I$4)","v":3},null,3,null,null,"TILD1X4S01-L"]
[4,4,null,1,null,0,4,2,null,null,null,null,{"$f":"(H10*$H$4)+(I10*$I$4)","v":4},null,4,null,null,"TILD1X4SO1-M"]
[{"$f":"(C11*$C$4)+(D11*$D$4)+(E11*$E$4)","v":5},5,1,null,null,0,5,1,1,null,null,null,5,null,5,null,null,"TILD1X4SO1-R"]
[{"$f":"(C12*$C$4)+(D12*$D$4)+(E12*$E$4)","v":6},6,null,null,2,1,6,null,2,null,null,null,6,null,6,null,null,"TILD1X5S01-L"]
[7,7,null,1,1,1,7,2,1,null,null,null,7,null,7,null,null,"TILD1X5SO1-M"]
[8,8,null,2,null,1,8,4,null,null,null,null,8,null,8,null,null,"TILD1X5SO1-R"]
[9,9,1,1,null,1,9,null,3,null,null,null,9,null,9,null,null,"TILVAB1"]
[10,10,2,null,null,1,10,2,2,null,null,null,10,null,10,null,null,"TILHDW1"]
[11,11,1,null,2,2,11,1,3,null,null,null,11,null,11,null,null,"TILSC2HSO1"]
[12,12,null,3,null,2,12,null,4,null,null,null,12,null,12,null,null,"TILSC3HSO1"]
[13,13,2,null,1,2,13,2,3,null,null,null,13,null,13]
[14,14,2,1,null,2,14,1,4,null,null,null,14,null,14]
[15,15,3,null,null,2,15,null,5,null,null,null,15,null,15]
[16,16,null,4,null,3,16,2,4,null,null,null,16,null,16]
[17,17,2,1,1,3,17,1,5,null,null,null,17,null,17]
[18,18,3,null,1,3,18,null,6,null,null,null,18,null,18]
[19,19,3,1,null,3,19,2,5,null,null,null,19,null,19]
[20,20,4,null,null,3,20,1,6,null,null,null,20,null,20]
[21,21,3,null,2,4,21,null,7,null,null,null,21,null,21]
[22,22,3,1,1,4,22,2,6,null,null,null,22,null,22]
[23,23,3,2,null,4,23,1,7,null,null,null,23,null,23]
[24,24,4,1,null,4,24,null,8,null,null,null,24,null,24]
[25,25,5,null,null,4,25,2,7,null,null,null,25,null,25]
[26,26,4,null,2,5,26,1,8,null,null,null,26,null,26]
[27,27,4,1,1,5,27,null,9,null,null,null,27,null,27]
[28,28,5,null,1,5,28,2,8,null,null,null,28,null,28]
[29,29,5,1,null,5,29,1,9,null,null,null,29,null,29]
[30,30,6,null,null,5,30,null,10,null,null,null,30,null,30]

{"sheet":"LG LSCB Configure Tool ","index":9,"n_rows":44,"n_cols":19,"rows_kept":44,"cut":false,"hidden":false,"merged":[[4,1,4,4],[7,4,7,5],[8,2,8,4],[12,1,12,3]]}
[]
[]
[]
[]
[null,"TiLED Part Number Configurator"]
[null,null,null,null,{"$f":"+C8&\" \"&E8","v":"LG LSCB Ultra Slim"}]
[null,null,null,null,{"$f":"IFERROR(VLOOKUP(E6,MFGSER,11,FALSE),\"\")","v":""},"acclaim p"]
[null,"Select Manufacturer","LG","Select dvLED Series","LSCB Ultra Slim"]
[null,{"$f":"IF(C9=\"Please Call Chief Project Manager for available options.  (952)-225-6931\",\"X\",\"Z\")","v":"Z"}]
[]
[null,"How Many Rows?\n(How many TiLES high?)\n\n","How Many Columns?\n(How many TiLES wide?)\n\n"]
[null,6,6]
[null,"For configuations taller than 10 displays high contact Chief Project Manager at (952)-225-6931 or send an email to lukas.westin@legrand.com"]
[]
[null,"Wall Mount Part #","Qty",null,"Side Cover Part #","Qty"]
[null,"TILD1X3LG2-L ",{"$f":"(VLOOKUP(B12,typeUSLIM,4,FALSE))","v":2},null,"Coming Soon! "]
[null,"TILD1X3LG2-M ",{"$f":"(VLOOKUP(B12,typeUSLIM,4,FALSE))*(C12-1)","v":10},null,"Coming Soon! "]
[null,"TILD1X3LG2-R ",{"$f":"(VLOOKUP(B12,typeUSLIM,4,FALSE))","v":2}]
[null,"TILD1X4LG2-L ",{"$f":"(VLOOKUP(B12,typeUSLIM,3,FALSE))","v":0}]
[null,"TILD1X4LG2-M",{"$f":"(VLOOKUP(B12,typeUSLIM,3,FALSE))*(C12-1)","v":0}]
[null,"TILD1X4LG2-R ",{"$f":"(VLOOKUP(B12,typeUSLIM,3,FALSE))","v":0}]
[null,"TILD1X5LG2-L ",{"$f":"(VLOOKUP(B12,typeUSLIM,2,FALSE))","v":0},null,null,"b,b,"]
[null,"TILD1X5LG2-M",{"$f":"(VLOOKUP(B12,typeUSLIM,2,FALSE))*(C12-1)","v":0}]
[null,"TILD1X5LG2-R ",{"$f":"(VLOOKUP(B12,typeUSLIM,2,FALSE))","v":0}]
[null,"TILVAB2",{"$f":"(VLOOKUP(B12,typeUSLIM,5,FALSE))*(C12+1)","v":7}]
[null,"TILHDW1",{"$f":"(VLOOKUP(B12,typeUSLIM,6,FALSE))*C12","v":36}]
[]
[]
[null,"legrandav.com/chief"]
[]
[{"$f":"+#REF!&G18","v":{"$error":"#REF!"}}]
[{"$f":"+#REF!&G18","v":{"$error":"#REF!"}}]
[{"$f":"+#REF!&G18","v":{"$error":"#REF!"}}]
[]
[]
[]
[]
[]
[null,null,null,null,null,null,null,{"$f":"IF((AND(H38=TRUE,#REF!= TRUE)), TRUE, FALSE)","v":{"$error":"#REF!"}},{"$f":"IF((AND(I38=TRUE, H39=TRUE)), TRUE, FALSE)","v":{"$error":"#REF!"}},{"$f":"IF((AND(J38=TRUE,#REF!= TRUE)), TRUE, FALSE)","v":{"$error":"#REF!"}},{"$f":"IF((AND(K38=TRUE,#REF!= TRUE)), TRUE, FALSE)","v":{"$error":"#REF!"}},{"$f":"IF((AND(L38=TRUE,#REF!= TRUE)), TRUE, FALSE)","v":{"$error":"#REF!"}},{"$error":"#REF!"},{"$error":"#REF!"},{"$error":"#REF!"},{"$error":"#REF!"},{"$error":"#REF!"},{"$error":"#REF!"},{"$error":"#REF!"}]
[null,null,null,null,null,null,null,{"$f":"IF((AND(H39=TRUE,#REF!= TRUE)), TRUE, FALSE)","v":{"$error":"#REF!"}},{"$error":"#REF!"},{"$f":"IF((AND(J39=TRUE,#REF!= TRUE)), TRUE, FALSE)","v":{"$error":"#REF!"}},{"$f":"IF((AND(K39=TRUE,#REF!= TRUE)), TRUE, FALSE)","v":{"$error":"#REF!"}},{"$f":"IF((AND(L39=TRUE,#REF!= TRUE)), TRUE, FALSE)","v":{"$error":"#REF!"}},{"$error":"#REF!"},{"$error":"#REF!"},{"$error":"#REF!"},{"$error":"#REF!"},{"$error":"#REF!"},{"$error":"#REF!"},{"$error":"#REF!"}]
[null,null,null,null,null,null,null,{"$f":"IF((AND(H40=TRUE,#REF!= TRUE)), TRUE, FALSE)","v":{"$error":"#REF!"}},{"$error":"#REF!"},{"$f":"IF((AND(J40=TRUE,#REF!= TRUE)), TRUE, FALSE)","v":{"$error":"#REF!"}},{"$f":"IF((AND(K40=TRUE,#REF!= TRUE)), TRUE, FALSE)","v":{"$error":"#REF!"}},{"$f":"IF((AND(L40=TRUE,#REF!= TRUE)), TRUE, FALSE)","v":{"$error":"#REF!"}},{"$error":"#REF!"},{"$error":"#REF!"},{"$error":"#REF!"},{"$error":"#REF!"},{"$error":"#REF!"},{"$error":"#REF!"},{"$error":"#REF!"}]
[null,null,null,null,null,null,null,{"$f":"IF((AND(H41=TRUE,#REF!= TRUE)), TRUE, FALSE)","v":{"$error":"#REF!"}},{"$error":"#REF!"},{"$f":"IF((AND(J41=TRUE,#REF!= TRUE)), TRUE, FALSE)","v":{"$error":"#REF!"}},{"$f":"IF((AND(K41=TRUE,#REF!= TRUE)), TRUE, FALSE)","v":{"$error":"#REF!"}},{"$f":"IF((AND(L41=TRUE,#REF!= TRUE)), TRUE, FALSE)","v":{"$error":"#REF!"}},{"$error":"#REF!"},{"$error":"#REF!"},{"$error":"#REF!"},{"$error":"#REF!"},{"$error":"#REF!"},{"$error":"#REF!"},{"$error":"#REF!"}]
[null,null,null,null,null,null,null,{"$f":"IF((AND(H42=TRUE,#REF!= TRUE)), TRUE, FALSE)","v":{"$error":"#REF!"}},{"$error":"#REF!"},{"$f":"IF((AND(J42=TRUE,#REF!= TRUE)), TRUE, FALSE)","v":{"$error":"#REF!"}},{"$f":"IF((AND(K42=TRUE,#REF!= TRUE)), TRUE, FALSE)","v":{"$error":"#REF!"}},{"$f":"IF((AND(L42=TRUE,#REF!= TRUE)), TRUE, FALSE)","v":{"$error":"#REF!"}},{"$error":"#REF!"},{"$error":"#REF!"},{"$error":"#REF!"},{"$error":"#REF!"},{"$error":"#REF!"},{"$error":"#REF!"},{"$error":"#REF!"}]
[null,null,null,null,null,null,null,{"$f":"IF((AND(H43=TRUE,#REF!= TRUE)), TRUE, FALSE)","v":{"$error":"#REF!"}},{"$error":"#REF!"},{"$f":"IF((AND(J43=TRUE,#REF!= TRUE)), TRUE, FALSE)","v":{"$error":"#REF!"}},{"$f":"IF((AND(K43=TRUE,#REF!= TRUE)), TRUE, FALSE)","v":{"$error":"#REF!"}},{"$f":"IF((AND(L43=TRUE,#REF!= TRUE)), TRUE, FALSE)","v":{"$error":"#REF!"}},{"$error":"#REF!"},{"$error":"#REF!"},{"$error":"#REF!"},{"$error":"#REF!"},{"$error":"#REF!"},{"$error":"#REF!"},{"$error":"#REF!"}]